program: Orca
programVersion: 5.0.4
elementType: F F F F F O O N N C C C C C C C C C C C C C C C C C C C C H H H H H H H H H H H H H H H H H
charge: 0
multiplicity: 1
keywords: wb97x-d3
keywords: def2-TZVPP
keywords: def2/J RIJCOSX
keywords: DEFGRID2
keywords: scfconv7
keywords: smallprint printgap noloewdin
keywords: NOSOSCF
formula: C20H17F5N2O2
InChI: InChI=1/C20H17F5N2O2/c21-15-9-8-14(20(23,24)25)17(18(15)22)19(27-29-11-13-6-7-13)26-16(28)10-12-4-2-1-3-5-12/h1-5,8-9,13,26H,6-7,10-11H2
46 atoms
F  1.705645 1.287234 1.877013
F  1.053307 -1.127562 -2.509291
F  2.956633 -2.071571 -2.838582
F  1.605829 -2.86937 -1.375008
F  4.364818 1.595756 1.979154
O  -1.361394 -1.453838 0.822945
O  1.007924 1.959846 -1.440455
N  -0.000535 -1.406558 0.738805
N  -0.447454 0.623769 -0.318888
C  -3.262592 -2.528917 1.691726
C  -4.200188 -2.809679 0.557519
C  -4.090882 -3.776904 1.693169
C  -1.788796 -2.646481 1.475376
C  0.404336 -0.3528 0.149563
C  1.877469 -0.184801 0.067677
C  2.694122 -0.84644 -0.85027
C  2.470926 0.637329 1.002189
C  -0.124203 1.704313 -1.090058
C  -1.308363 2.547819 -1.523573
C  4.070035 -0.677349 -0.805436
C  2.079639 -1.731071 -1.892969
C  -2.491433 2.524893 -0.597039
C  3.842983 0.801746 1.047805
C  4.650057 0.146459 0.146862
C  -2.518468 3.358129 0.519566
C  -3.555667 1.650776 -0.808493
C  -3.585131 3.319492 1.404385
C  -4.621951 1.605837 0.080934
C  -4.639255 2.440637 1.188628
H  -3.560767 -1.751931 2.388202
H  -3.772721 -3.09482 -0.396364
H  -5.096802 -2.207938 0.48138
H  -3.590141 -4.72048 1.512676
H  -4.908375 -3.837363 2.399779
H  -1.552756 -3.517664 0.85454
H  -1.260228 -2.756015 2.427046
H  -1.424403 0.488621 -0.090931
H  -1.594685 2.185841 -2.516356
H  -0.939391 3.565009 -1.659296
H  4.715994 -1.180798 -1.509964
H  5.723215 0.278269 0.184456
H  -1.697836 4.043877 0.695904
H  -3.551206 0.998974 -1.674814
H  -3.594407 3.977381 2.264036
H  -5.441481 0.921341 -0.097157
H  -5.47123 2.409561 1.880391
elementType: F O N C H
totalener: -1531.67203986 hartree
nucrepener: 2914.31927221 hartree
electener: -4445.99131208 hartree
oneelecener: -7898.78054546 hartree
twoeener: 3452.78923338 hartree
cpcmener: -0.02921791 hartree
kineticenergy: 1525.79216948 hartree
xcener: -138.189470856758 hartree
chargesum: -0.0000000
charge: -0.200432 -0.176906 -0.174333 -0.171280 -0.198215 -0.241361 -0.468391 -0.168444 -0.176692 -0.088884 -0.172733 -0.197105 0.058675 0.261815 -0.086882 -0.114722 0.253748 0.349247 -0.049314 -0.079804 0.533123 -0.013753 0.199208 -0.167493 -0.190883 -0.197297 -0.140738 -0.157822 -0.152420 0.093708 0.087514 0.092526 0.089191 0.096425 0.080658 0.085862 0.197966 0.120503 0.109887 0.151174 0.157537 0.143354 0.148851 0.158016 0.158277 0.158638
qa: -0.2004 -0.1769 -0.1743 -0.1713 -0.1982 -0.2414 -0.4684 -0.1684 -0.1767 -0.0889 -0.1727 -0.1971 0.0587 0.2618 -0.0869 -0.1147 0.2537 0.3492 -0.0493 -0.0798 0.5331 -0.0138 0.1992 -0.1675 -0.1909 -0.1973 -0.1407 -0.1578 -0.1524 0.0937 0.0875 0.0925 0.0892 0.0964 0.0807 0.0859 0.1980 0.1205 0.1099 0.1512 0.1575 0.1434 0.1489 0.1580 0.1583 0.1586
va: 1.1043 1.1206 1.1298 1.1260 1.0987 1.9627 2.0383 2.9176 3.2726 3.8542 3.8798 3.9410 3.8971 3.9102 3.8328 3.7503 3.9119 4.1275 3.8108 3.8772 4.4574 3.6131 4.0241 3.9138 3.9615 3.8981 3.8876 3.8750 3.8938 1.0119 1.0178 1.0186 1.0168 1.0163 0.9978 1.0070 1.0210 1.0037 1.0194 1.0053 0.9951 1.0024 1.0026 0.9901 0.9911 0.9898
dispcorr: -0.023367000 hartree
energy: -1531.695406863318
dipole: -45.65903 44.30133 -1.35770 -0.83614 0.70560 -0.13054 9.61916 -9.24770 0.37146
magnitude: 1.41364 au
magnitude: 3.59318 debye
