program: Orca
programVersion: 5.0.4
elementType: F F F F F O O N N C C C C C C C C C C C C C C C C C C C C H H H H H H H H H H H H H H H H H
charge: 0
multiplicity: 1
keywords: wb97x-d3
keywords: def2-TZVPP
keywords: def2/J RIJCOSX
keywords: DEFGRID2
keywords: scfconv7
keywords: smallprint printgap noloewdin
keywords: NOSOSCF
formula: C20H17F5N2O2
InChI: InChI=1/C20H17F5N2O2/c21-15-9-8-14(20(23,24)25)17(18(15)22)19(27-29-11-13-6-7-13)26-16(28)10-12-4-2-1-3-5-12/h1-5,8-9,13,26H,6-7,10-11H2
46 atoms
F  2.690166 0.134495 2.405713
F  0.111229 -1.262414 -1.743223
F  0.706714 0.630212 -2.571977
F  1.614738 -1.183915 -3.268457
F  5.230921 0.086132 1.616331
O  -1.064233 -1.168487 1.920692
O  1.127317 2.454821 0.089058
N  0.214168 -1.25677 1.455557
N  -0.345455 0.765833 0.427895
C  -2.835907 -2.175914 3.086372
C  -4.035408 -2.086436 2.191911
C  -3.840935 -3.286263 3.063024
C  -1.489804 -2.407683 2.480243
C  0.53503 -0.246646 0.751222
C  1.919125 -0.2360 0.218264
C  2.238411 -0.424875 -1.13149
C  2.954178 -0.067996 1.117654
C  -0.015375 2.049013 0.096821
C  -1.197947 2.947872 -0.213004
C  3.565002 -0.436516 -1.536544
C  1.166385 -0.565876 -2.174318
C  -2.401585 2.244116 -0.773903
C  4.275277 -0.083641 0.706317
C  4.590155 -0.267182 -0.619179
C  -3.447405 1.84202 0.053609
C  -2.463463 1.936658 -2.131763
C  -4.527119 1.135582 -0.461813
C  -3.543166 1.237106 -2.648933
C  -4.575772 0.829239 -1.813776
H  -2.838836 -1.542656 3.967462
H  -3.883032 -2.201867 1.12519
H  -4.811844 -1.379854 2.456144
H  -3.559228 -4.219297 2.590001
H  -4.479759 -3.403616 3.928663
H  -1.541756 -3.173151 1.698272
H  -0.768075 -2.74107 3.232243
H  -1.327733 0.540329 0.526786
H  -0.838806 3.716938 -0.897863
H  -1.454124 3.458175 0.721006
H  3.82765 -0.580667 -2.574719
H  5.624468 -0.278915 -0.935844
H  -3.417372 2.081011 1.110663
H  -1.663684 2.252607 -2.790587
H  -5.331121 0.828431 0.194772
H  -3.577213 1.006105 -3.706041
H  -5.415894 0.278583 -2.217127
elementType: F O N C H
totalener: -1531.67057901 hartree
nucrepener: 2949.59524851 hartree
electener: -4481.26582752 hartree
oneelecener: -7969.16295566 hartree
twoeener: 3487.89712814 hartree
cpcmener: -0.02990795 hartree
kineticenergy: 1525.78200452 hartree
xcener: -138.187079539772 hartree
chargesum: 0.0000000
charge: -0.195037 -0.176572 -0.174791 -0.173460 -0.197201 -0.247109 -0.463260 -0.162034 -0.161031 -0.084439 -0.176026 -0.201121 0.062709 0.256326 -0.087751 -0.092274 0.234908 0.300117 -0.027969 -0.092888 0.541771 0.021470 0.205484 -0.165693 -0.209227 -0.233693 -0.150193 -0.128728 -0.159945 0.094531 0.086432 0.095394 0.090133 0.096689 0.081067 0.088807 0.199216 0.109626 0.122639 0.149466 0.157651 0.149701 0.140344 0.159003 0.158317 0.158640
qa: -0.1950 -0.1766 -0.1748 -0.1735 -0.1972 -0.2471 -0.4633 -0.1620 -0.1610 -0.0844 -0.1760 -0.2011 0.0627 0.2563 -0.0878 -0.0923 0.2349 0.3001 -0.0280 -0.0929 0.5418 0.0215 0.2055 -0.1657 -0.2092 -0.2337 -0.1502 -0.1287 -0.1599 0.0945 0.0864 0.0954 0.0901 0.0967 0.0811 0.0888 0.1992 0.1096 0.1226 0.1495 0.1577 0.1497 0.1403 0.1590 0.1583 0.1586
va: 1.1130 1.1249 1.1146 1.1325 1.0993 1.9614 2.0427 2.9198 3.2286 3.8535 3.8695 3.9487 3.8884 3.9398 3.7758 3.7053 3.9541 4.1599 3.7760 3.9174 4.4263 3.5670 4.0074 3.9126 3.8972 3.9561 3.8736 3.8839 3.9051 1.0116 1.0187 1.0164 1.0152 1.0164 0.9998 1.0064 1.0143 1.0215 1.0020 1.0065 0.9950 1.0031 1.0118 0.9901 0.9896 0.9898
dispcorr: -0.024457673 hartree
energy: -1531.695036681105
dipole: -42.92396 41.42080 -1.50315 -3.56746 3.04927 -0.51819 11.17911 -11.60425 -0.42514
magnitude: 1.64582 au
magnitude: 4.18335 debye
