program: Orca
programVersion: 5.0.4
elementType: F F F F F O O N N C C C C C C C C C C C C C C C C C C C C H H H H H H H H H H H H H H H H H
charge: 0
multiplicity: 1
keywords: wb97x-d3
keywords: def2-TZVPP
keywords: def2/J RIJCOSX
keywords: DEFGRID2
keywords: scfconv7
keywords: smallprint printgap noloewdin
keywords: NOSOSCF
formula: C20H17F5N2O2
InChI: InChI=1/C20H17F5N2O2/c21-15-9-8-14(20(23,24)25)17(18(15)22)19(27-29-11-13-6-7-13)26-16(28)10-12-4-2-1-3-5-12/h1-5,8-9,13,26H,6-7,10-11H2
46 atoms
F  1.951121 1.42416 1.747797
F  2.650608 -2.140498 -2.911505
F  1.596355 -3.001185 -1.252875
F  0.771047 -1.30572 -2.28986
F  4.610587 1.647462 1.607143
O  -1.277712 -1.293764 1.109366
O  1.041316 2.018618 -1.35994
N  0.069961 -1.304642 0.897351
N  -0.392792 0.720634 -0.167696
C  -3.154424 -2.355026 2.048278
C  -4.170244 -2.431849 0.949297
C  -4.052723 -3.54931 1.936579
C  -1.705977 -2.510463 1.715707
C  0.459345 -0.276773 0.254591
C  1.923133 -0.16976 0.037305
C  2.634441 -0.91084 -0.906631
C  2.619897 0.687629 0.862521
C  -0.080502 1.788874 -0.95964
C  -1.245972 2.683612 -1.337972
C  4.014492 -0.787736 -0.987297
C  1.913708 -1.840589 -1.838828
C  -2.526891 2.469938 -0.585055
C  3.992815 0.808167 0.780646
C  4.69986 0.068877 -0.140503
C  -3.495061 1.588961 -1.062283
C  -2.749254 3.118683 0.628011
C  -4.658681 1.357785 -0.341279
C  -3.913318 2.892622 1.347689
C  -4.87028 2.009247 0.865533
H  -3.369364 -1.666223 2.858572
H  -3.814811 -2.602907 -0.059965
H  -5.03195 -1.779817 1.013323
H  -3.618043 -4.483083 1.600777
H  -4.831908 -3.664298 2.678898
H  -1.55149 -3.345178 1.023485
H  -1.113583 -2.703729 2.615169
H  -1.359295 0.611359 0.110965
H  -1.403025 2.532106 -2.409769
H  -0.896687 3.711668 -1.224802
H  4.581909 -1.354765 -1.710984
H  5.775627 0.164111 -0.201973
H  -3.335396 1.077157 -2.004257
H  -2.004268 3.806084 1.011882
H  -5.402072 0.6717 -0.726499
H  -4.073672 3.407119 2.286662
H  -5.778281 1.83243 1.427511
elementType: F O N C H
totalener: -1531.67237614 hartree
nucrepener: 2922.48641721 hartree
electener: -4454.15879334 hartree
oneelecener: -7915.12207249 hartree
twoeener: 3460.96327915 hartree
cpcmener: -0.02915074 hartree
kineticenergy: 1525.79183287 hartree
xcener: -138.190245844583 hartree
chargesum: 0.0000000
charge: -0.201124 -0.175205 -0.172854 -0.177284 -0.198166 -0.241837 -0.475887 -0.166829 -0.174120 -0.082447 -0.178894 -0.199926 0.057258 0.270644 -0.084929 -0.111340 0.255822 0.348377 -0.027747 -0.082909 0.531635 -0.034125 0.198602 -0.170093 -0.179729 -0.191712 -0.175803 -0.138905 -0.145090 0.095148 0.088420 0.091402 0.090586 0.096529 0.081475 0.087201 0.193357 0.117574 0.113851 0.149364 0.157292 0.144495 0.141881 0.159635 0.158250 0.158157
qa: -0.2011 -0.1752 -0.1729 -0.1773 -0.1982 -0.2418 -0.4759 -0.1668 -0.1741 -0.0824 -0.1789 -0.1999 0.0573 0.2706 -0.0849 -0.1113 0.2558 0.3484 -0.0277 -0.0829 0.5316 -0.0341 0.1986 -0.1701 -0.1797 -0.1917 -0.1758 -0.1389 -0.1451 0.0951 0.0884 0.0914 0.0906 0.0965 0.0815 0.0872 0.1934 0.1176 0.1139 0.1494 0.1573 0.1445 0.1419 0.1596 0.1583 0.1582
va: 1.1035 1.1284 1.1219 1.1213 1.0991 1.9619 2.0315 2.9201 3.2753 3.8505 3.8746 3.9498 3.8936 3.9109 3.8193 3.7537 3.8912 4.1308 3.7982 3.8922 4.4567 3.6136 4.0294 3.9173 3.9198 3.9608 3.8757 3.8863 3.8805 1.0105 1.0180 1.0178 1.0161 1.0165 0.9990 1.0069 1.0260 1.0095 1.0164 1.0059 0.9952 1.0034 1.0039 0.9902 0.9902 0.9901
dispcorr: -0.023805771 hartree
energy: -1531.696181907970
dipole: -45.70367 44.32610 -1.37758 -0.17517 0.04181 -0.13335 10.78831 -10.45001 0.33830
magnitude: 1.42476 au
magnitude: 3.62145 debye
