program: Orca
programVersion: 5.0.4
elementType: F F F F F O O N N C C C C C C C C C C C C C C C C C C C C H H H H H H H H H H H H H H H H H
charge: 0
multiplicity: 1
keywords: wb97x-d3
keywords: def2-TZVPP
keywords: def2/J RIJCOSX
keywords: DEFGRID2
keywords: scfconv7
keywords: smallprint printgap noloewdin
keywords: NOSOSCF
formula: C20H17F5N2O2
InChI: InChI=1/C20H17F5N2O2/c21-15-9-8-14(20(23,24)25)17(18(15)22)19(27-29-11-13-6-7-13)26-16(28)10-12-4-2-1-3-5-12/h1-5,8-9,13,26H,6-7,10-11H2
46 atoms
F  1.335228 0.501955 -2.458028
F  3.445169 -0.940815 2.867573
F  1.408501 -0.377196 2.48709
F  2.084523 -2.360841 2.007776
F  3.928575 0.705083 -3.093551
O  -1.417123 -1.587701 0.18116
O  1.218342 2.302023 0.475839
N  -0.076733 -1.580373 -0.074163
N  -0.379146 0.719783 0.149104
C  -3.377721 -2.827583 0.52237
C  -4.429183 -2.252398 -0.377376
C  -4.398008 -3.723737 -0.109103
C  -1.963072 -2.895782 0.045905
C  0.398885 -0.39932 -0.051414
C  1.853686 -0.272838 -0.31004
C  2.833502 -0.608216 0.624997
C  2.254821 0.16646 -1.554873
C  0.048446 1.990501 0.409564
C  -1.062719 2.993311 0.661373
C  4.176347 -0.514971 0.290241
C  2.442165 -1.072426 1.996329
C  -2.406332 2.621444 0.102302
C  3.594119 0.270053 -1.881673
C  4.561556 -0.075263 -0.965995
C  -3.37472 2.019528 0.902051
C  -2.682004 2.824051 -1.248978
C  -4.592327 1.623567 0.363002
C  -3.897508 2.432092 -1.788301
C  -4.855717 1.827953 -0.983619
H  -3.492991 -2.642096 1.58524
H  -4.124778 -1.90514 -1.357538
H  -5.217218 -1.665358 0.076595
H  -4.075239 -4.381677 -0.907032
H  -5.160992 -4.146051 0.531762
H  -1.917721 -3.216376 -1.000699
H  -1.379345 -3.603331 0.642464
H  -1.377961 0.554835 0.152654
H  -0.722042 3.949156 0.260362
H  -1.121659 3.11803 1.747214
H  4.947171 -0.776124 1.000753
H  5.60821 0.002956 -1.22801
H  -3.174068 1.854708 1.954362
H  -1.935811 3.288015 -1.883562
H  -5.335199 1.158252 0.998207
H  -4.09724 2.596504 -2.839454
H  -5.804059 1.520586 -1.405241
elementType: F O N C H
totalener: -1531.67210758 hartree
nucrepener: 2924.97471108 hartree
electener: -4456.64681865 hartree
oneelecener: -7920.11847935 hartree
twoeener: 3463.47166069 hartree
cpcmener: -0.02923168 hartree
kineticenergy: 1525.80264502 hartree
xcener: -138.192156762597 hartree
chargesum: -0.0000000
charge: -0.200358 -0.175098 -0.176331 -0.171712 -0.197808 -0.240440 -0.470968 -0.169578 -0.176684 -0.077088 -0.180907 -0.201162 0.057319 0.267623 -0.096387 -0.108074 0.266856 0.345737 -0.040733 -0.088736 0.533451 -0.022568 0.197333 -0.167015 -0.180228 -0.198149 -0.172846 -0.131281 -0.151555 0.094925 0.088001 0.092763 0.090138 0.096570 0.079695 0.087808 0.195041 0.112033 0.118353 0.149653 0.157621 0.144449 0.143591 0.159951 0.158146 0.158652
qa: -0.2004 -0.1751 -0.1763 -0.1717 -0.1978 -0.2404 -0.4710 -0.1696 -0.1767 -0.0771 -0.1809 -0.2012 0.0573 0.2676 -0.0964 -0.1081 0.2669 0.3457 -0.0407 -0.0887 0.5335 -0.0226 0.1973 -0.1670 -0.1802 -0.1981 -0.1728 -0.1313 -0.1516 0.0949 0.0880 0.0928 0.0901 0.0966 0.0797 0.0878 0.1950 0.1120 0.1184 0.1497 0.1576 0.1444 0.1436 0.1600 0.1581 0.1587
va: 1.1041 1.1283 1.1228 1.1226 1.0990 1.9626 2.0363 2.9155 3.2730 3.8465 3.8732 3.9570 3.8969 3.9157 3.8284 3.7480 3.8963 4.1330 3.8024 3.9014 4.4526 3.6230 4.0224 3.9132 3.9039 3.9652 3.8636 3.8768 3.8725 1.0113 1.0180 1.0172 1.0161 1.0166 0.9987 1.0061 1.0239 1.0181 1.0064 1.0064 0.9950 1.0035 1.0029 0.9905 0.9899 0.9901
dispcorr: -0.024045733 hartree
energy: -1531.696153311825
dipole: -47.45369 46.02871 -1.42498 -1.66692 1.48736 -0.17956 -3.34649 3.21684 -0.12965
magnitude: 1.44209 au
magnitude: 3.66551 debye
