program: Orca
programVersion: 5.0.4
elementType: F F F F F O O N N C C C C C C C C C C C C C C C C C C C C H H H H H H H H H H H H H H H H H
charge: 0
multiplicity: 1
keywords: wb97x-d3
keywords: def2-TZVPP
keywords: def2/J RIJCOSX
keywords: DEFGRID2
keywords: scfconv7
keywords: smallprint printgap noloewdin
keywords: NOSOSCF
formula: C20H17F5N2O2
InChI: InChI=1/C20H17F5N2O2/c21-15-9-8-14(20(23,24)25)17(18(15)22)19(27-29-11-13-6-7-13)26-16(28)10-12-4-2-1-3-5-12/h1-5,8-9,13,26H,6-7,10-11H2
46 atoms
F  1.679341 1.105596 2.031214
F  3.027512 -1.79157 -2.962592
F  1.693423 -2.740293 -1.573366
F  1.099288 -0.931821 -2.573607
F  4.325751 1.442993 2.187903
O  -1.332819 -1.595295 0.61106
O  0.9901 2.012848 -1.374028
N  0.026431 -1.477978 0.62825
N  -0.449277 0.588144 -0.343482
C  -3.184016 -3.000705 0.959387
C  -4.090819 -3.618421 1.978034
C  -4.258248 -2.179277 1.605206
C  -1.753915 -2.7580 1.318537
C  0.417223 -0.380232 0.115171
C  1.887608 -0.175904 0.082407
C  2.725734 -0.739777 -0.881888
C  2.457973 0.559905 1.09896
C  -0.142069 1.701179 -1.074361
C  -1.347521 2.501117 -1.531647
C  4.097323 -0.553737 -0.806395
C  2.138269 -1.551984 -1.997997
C  -2.5323 2.454739 -0.607657
C  3.827627 0.737814 1.175872
C  4.654446 0.186969 0.225251
C  -2.560384 3.265261 0.525739
C  -3.594216 1.582703 -0.836354
C  -3.6259 3.206322 1.410353
C  -4.660601 1.518398 0.052316
C  -4.678739 2.330103 1.17704
H  -3.349261 -3.291759 -0.07291
H  -3.679322 -3.847637 2.953721
H  -4.827687 -4.330438 1.629584
H  -3.96012 -1.427717 2.32658
H  -5.113544 -1.90253 1.002121
H  -1.127501 -3.607898 1.032821
H  -1.640849 -2.601556 2.397317
H  -1.427565 0.410812 -0.153945
H  -1.618654 2.1117 -2.518352
H  -1.011193 3.527124 -1.683473
H  4.758456 -0.982211 -1.545547
H  5.724762 0.331166 0.287771
H  -1.740518 3.948487 0.715271
H  -3.588644 0.947686 -1.714975
H  -3.635245 3.846044 2.283591
H  -5.479231 0.836619 -0.139445
H  -5.510589 2.283788 1.868034
elementType: F O N C H
totalener: -1531.67176436 hartree
nucrepener: 2916.01104258 hartree
electener: -4447.68280693 hartree
oneelecener: -7902.15522504 hartree
twoeener: 3454.47241810 hartree
cpcmener: -0.02932745 hartree
kineticenergy: 1525.79339661 hartree
xcener: -138.189516809320 hartree
chargesum: -0.0000000
charge: -0.199620 -0.174313 -0.171630 -0.176347 -0.198120 -0.244058 -0.466283 -0.170029 -0.171627 -0.078062 -0.201254 -0.178970 0.058596 0.256717 -0.092705 -0.111027 0.265778 0.347198 -0.051599 -0.086947 0.535357 -0.013437 0.193943 -0.164562 -0.191873 -0.191298 -0.138160 -0.166549 -0.151637 0.093629 0.089659 0.096705 0.087087 0.094192 0.087287 0.080412 0.195810 0.120138 0.109688 0.151345 0.157640 0.143511 0.148517 0.158398 0.159936 0.158565
qa: -0.1996 -0.1743 -0.1716 -0.1763 -0.1981 -0.2441 -0.4663 -0.1700 -0.1716 -0.0781 -0.2013 -0.1790 0.0586 0.2567 -0.0927 -0.1110 0.2658 0.3472 -0.0516 -0.0869 0.5354 -0.0134 0.1939 -0.1646 -0.1919 -0.1913 -0.1382 -0.1665 -0.1516 0.0936 0.0897 0.0967 0.0871 0.0942 0.0873 0.0804 0.1958 0.1201 0.1097 0.1513 0.1576 0.1435 0.1485 0.1584 0.1599 0.1586
va: 1.1059 1.1301 1.1253 1.1210 1.0986 1.9627 2.0398 2.9147 3.2678 3.8538 3.9509 3.8708 3.8944 3.9178 3.8302 3.7399 3.9231 4.1253 3.8074 3.8885 4.4511 3.6166 4.0200 3.9094 3.9612 3.8896 3.8859 3.8689 3.8848 1.0115 1.0162 1.0163 1.0178 1.0172 1.0079 0.9976 1.0217 1.0033 1.0196 1.0053 0.9950 1.0022 1.0028 0.9898 0.9898 0.9901
dispcorr: -0.023645574 hartree
energy: -1531.695409931348
dipole: -46.02412 44.67669 -1.34743 -0.70836 0.52864 -0.17973 10.97949 -10.65837 0.32112
magnitude: 1.39678 au
magnitude: 3.55034 debye
