program: Orca
programVersion: 5.0.4
elementType: F F F F F O O N N C C C C C C C C C C C C C C C C C C C C H H H H H H H H H H H H H H H H H
charge: 0
multiplicity: 1
keywords: wb97x-d3
keywords: def2-TZVPP
keywords: def2/J RIJCOSX
keywords: DEFGRID2
keywords: scfconv7
keywords: smallprint printgap noloewdin
keywords: NOSOSCF
formula: C20H17F5N2O2
InChI: InChI=1/C20H17F5N2O2/c21-15-9-8-14(20(23,24)25)17(18(15)22)19(27-29-11-13-6-7-13)26-16(28)10-12-4-2-1-3-5-12/h1-5,8-9,13,26H,6-7,10-11H2
46 atoms
F  2.555431 0.709232 2.238646
F  1.744953 -1.016617 -3.355157
F  1.027873 -2.35567 -1.839638
F  0.16491 -0.396629 -2.041917
F  5.108854 0.985004 1.470924
O  -1.010836 -1.548313 1.574369
O  0.988356 2.378101 -0.177648
N  0.252807 -1.513362 1.057825
N  -0.257742 0.750788 0.810457
C  -2.746804 -2.799182 2.531518
C  -3.979681 -2.443123 1.757051
C  -3.794252 -3.836455 2.269024
C  -1.437269 -2.885846 1.814384
C  0.578206 -0.337536 0.692842
C  1.954097 -0.174806 0.159784
C  2.334466 -0.528522 -1.134098
C  2.91121 0.336801 1.010664
C  -0.049347 2.017823 0.332345
C  -1.255856 2.918498 0.495596
C  3.653787 -0.374738 -1.536769
C  1.318521 -1.075265 -2.092573
C  -2.440898 2.393621 -0.27487
C  4.224157 0.488684 0.609264
C  4.603914 0.132849 -0.665022
C  -2.444224 2.451744 -1.667287
C  -3.526636 1.817697 0.377299
C  -3.515418 1.950179 -2.390714
C  -4.598826 1.310995 -0.346341
C  -4.59606 1.37689 -1.732037
H  -2.685367 -2.423576 3.547809
H  -3.877583 -2.274727 0.69145
H  -4.715466 -1.81131 2.238115
H  -3.571715 -4.618197 1.552876
H  -4.399696 -4.161866 3.10522
H  -1.545881 -3.421332 0.864651
H  -0.689591 -3.411868 2.415888
H  -1.164723 0.551173 1.212171
H  -0.977134 3.913315 0.149505
H  -1.49934 2.994736 1.558586
H  3.963976 -0.642127 -2.536525
H  5.632034 0.256299 -0.978063
H  -1.60509 2.898329 -2.188277
H  -3.537911 1.767535 1.460148
H  -3.507269 2.007503 -3.471709
H  -5.437951 0.868848 0.175653
H  -5.432973 0.987493 -2.297425
elementType: F O N C H
totalener: -1531.67168556 hartree
nucrepener: 2934.03163220 hartree
electener: -4465.70331775 hartree
oneelecener: -7938.29194699 hartree
twoeener: 3472.58862924 hartree
cpcmener: -0.03022454 hartree
kineticenergy: 1525.79420004 hartree
xcener: -138.188470194240 hartree
chargesum: -0.0000000
charge: -0.200569 -0.174681 -0.171858 -0.176273 -0.198399 -0.247449 -0.454049 -0.167268 -0.168286 -0.086560 -0.176973 -0.197550 0.058662 0.265252 -0.092526 -0.103815 0.269294 0.340430 -0.070905 -0.093166 0.534661 0.025352 0.193514 -0.163895 -0.218085 -0.198887 -0.134838 -0.146678 -0.167011 0.093920 0.086052 0.095666 0.089969 0.096548 0.081322 0.087463 0.184065 0.107204 0.126589 0.150373 0.157894 0.143502 0.147087 0.158492 0.157629 0.158779
qa: -0.2006 -0.1747 -0.1719 -0.1763 -0.1984 -0.2474 -0.4540 -0.1673 -0.1683 -0.0866 -0.1770 -0.1975 0.0587 0.2653 -0.0925 -0.1038 0.2693 0.3404 -0.0709 -0.0932 0.5347 0.0254 0.1935 -0.1639 -0.2181 -0.1989 -0.1348 -0.1467 -0.1670 0.0939 0.0861 0.0957 0.0900 0.0965 0.0813 0.0875 0.1841 0.1072 0.1266 0.1504 0.1579 0.1435 0.1471 0.1585 0.1576 0.1588
va: 1.1040 1.1290 1.1236 1.1210 1.0986 1.9526 2.0440 2.9125 3.2611 3.8555 3.8726 3.9428 3.8919 3.9332 3.8261 3.7432 3.8826 4.1115 3.7778 3.8987 4.4469 3.5686 4.0340 3.9098 3.9338 3.9170 3.8854 3.8801 3.9088 1.0111 1.0194 1.0159 1.0156 1.0162 0.9990 1.0068 1.0295 1.0228 1.0081 1.0057 0.9947 1.0081 1.0015 0.9896 0.9905 0.9898
dispcorr: -0.023624967 hartree
energy: -1531.695310523356
dipole: -43.03403 41.74341 -1.29062 -3.89777 3.66912 -0.22865 10.56699 -10.23582 0.33117
magnitude: 1.35191 au
magnitude: 3.43627 debye
