program: Orca
programVersion: 5.0.4
elementType: F F F F F O O N N C C C C C C C C C C C C C C C C C C C C H H H H H H H H H H H H H H H H H
charge: 0
multiplicity: 1
keywords: wb97x-d3
keywords: def2-TZVPP
keywords: def2/J RIJCOSX
keywords: DEFGRID2
keywords: scfconv7
keywords: smallprint printgap noloewdin
keywords: NOSOSCF
formula: C20H17F5N2O2
InChI: InChI=1/C20H17F5N2O2/c21-15-9-8-14(20(23,24)25)17(18(15)22)19(27-29-11-13-6-7-13)26-16(28)10-12-4-2-1-3-5-12/h1-5,8-9,13,26H,6-7,10-11H2
46 atoms
F  2.559792 -0.283838 -2.466133
F  0.281361 0.545804 1.954773
F  0.935068 -1.442424 2.453858
F  1.854182 0.260253 3.38695
F  5.157572 0.027012 -1.870068
O  -1.175436 -1.778054 -0.869126
O  1.168162 2.343863 -0.77379
N  0.137604 -1.670909 -0.50334
N  -0.24187 0.574186 -1.003176
C  -3.117762 -3.096992 -0.979194
C  -4.083971 -3.943577 -0.208944
C  -4.16353 -2.452206 -0.121037
C  -1.689289 -3.064376 -0.538463
C  0.555585 -0.47114 -0.5936
C  1.970844 -0.248161 -0.200869
C  2.379055 -0.136411 1.129506
C  2.929476 -0.190254 -1.190531
C  0.056278 1.910147 -0.98223
C  -1.136245 2.799647 -1.27851
C  3.722968 0.018154 1.43581
C  1.363973 -0.194284 2.232212
C  -2.398462 2.354042 -0.58869
C  4.267947 -0.028981 -0.882211
C  4.672909 0.072682 0.428612
C  -3.446831 1.779418 -1.300622
C  -2.511404 2.472375 0.796123
C  -4.587049 1.33115 -0.644231
C  -3.647836 2.026581 1.452515
C  -4.689346 1.45165 0.733709
H  -3.267595 -3.047547 -2.053041
H  -3.711481 -4.486205 0.651791
H  -4.850345 -4.468256 -0.764917
H  -3.843141 -1.976729 0.798618
H  -4.987492 -1.953764 -0.615707
H  -1.101742 -3.83903 -1.04129
H  -1.614789 -3.231315 0.541652
H  -1.202601 0.319962 -1.195799
H  -1.279089 2.812402 -2.363411
H  -0.864678 3.81327 -0.982243
H  4.054633 0.101259 2.46069
H  5.722301 0.195678 0.661892
H  -3.373284 1.679249 -2.377442
H  -1.703864 2.920191 1.36422
H  -5.394743 0.888119 -1.212875
H  -3.72138 2.125835 2.528093
H  -5.576561 1.102476 1.246578
elementType: F O N C H
totalener: -1531.67113476 hartree
nucrepener: 2957.11905147 hartree
electener: -4488.79018624 hartree
oneelecener: -7984.39565997 hartree
twoeener: 3495.60547373 hartree
cpcmener: -0.02941231 hartree
kineticenergy: 1525.77801099 hartree
xcener: -138.186111299802 hartree
chargesum: -0.0000000
charge: -0.199115 -0.175069 -0.171704 -0.174571 -0.198048 -0.249279 -0.456977 -0.170586 -0.173496 -0.073071 -0.202071 -0.184341 0.057939 0.260682 -0.097408 -0.106007 0.280884 0.340490 -0.056504 -0.100508 0.540518 0.010655 0.187600 -0.159754 -0.191900 -0.222365 -0.153361 -0.118923 -0.169008 0.094145 0.090801 0.095571 0.089527 0.094420 0.087262 0.079053 0.192994 0.120799 0.108256 0.151193 0.157802 0.145044 0.142518 0.158977 0.158472 0.158465
qa: -0.1991 -0.1751 -0.1717 -0.1746 -0.1980 -0.2493 -0.4570 -0.1706 -0.1735 -0.0731 -0.2021 -0.1843 0.0579 0.2607 -0.0974 -0.1060 0.2809 0.3405 -0.0565 -0.1005 0.5405 0.0107 0.1876 -0.1598 -0.1919 -0.2224 -0.1534 -0.1189 -0.1690 0.0941 0.0908 0.0956 0.0895 0.0944 0.0873 0.0791 0.1930 0.1208 0.1083 0.1512 0.1578 0.1450 0.1425 0.1590 0.1585 0.1585
va: 1.1059 1.1206 1.1240 1.1302 1.0985 1.9502 2.0473 2.9115 3.2568 3.8448 3.9578 3.8720 3.8973 3.9363 3.8086 3.7440 3.8973 4.1259 3.7808 3.9098 4.4345 3.6084 4.0301 3.9063 3.8989 3.9470 3.8417 3.8631 3.8721 1.0120 1.0155 1.0172 1.0177 1.0167 1.0052 1.0001 1.0251 1.0043 1.0215 1.0053 0.9948 1.0030 1.0072 0.9904 0.9892 0.9902
dispcorr: -0.024886745 hartree
energy: -1531.696021508177
dipole: -44.54071 43.16108 -1.37963 -5.73274 5.49634 -0.23640 -5.45491 5.54921 0.09430
magnitude: 1.40291 au
magnitude: 3.56592 debye
