program: Orca
programVersion: 5.0.4
elementType: F F F F F O O N N C C C C C C C C C C C C C C C C C C C C H H H H H H H H H H H H H H H H H
charge: 0
multiplicity: 1
keywords: wb97x-d3
keywords: def2-TZVPP
keywords: def2/J RIJCOSX
keywords: DEFGRID2
keywords: scfconv7
keywords: smallprint printgap noloewdin
keywords: NOSOSCF
formula: C20H17F5N2O2
InChI: InChI=1/C20H17F5N2O2/c21-15-9-8-14(20(23,24)25)17(18(15)22)19(27-29-11-13-6-7-13)26-16(28)10-12-4-2-1-3-5-12/h1-5,8-9,13,26H,6-7,10-11H2
46 atoms
F  0.626942 1.388346 1.376236
F  3.296505 -2.195042 -2.508691
F  1.895489 -3.163442 -1.211089
F  1.218071 -1.666483 -2.601761
F  3.126935 2.177146 1.867604
O  -1.68495 -2.115495 -0.029219
O  0.457844 1.563154 -1.976892
N  -0.365049 -1.825459 0.145595
N  -0.961564 0.22318 -0.818255
C  -1.932487 -3.56752 1.917455
C  -3.144124 -3.199905 2.716414
C  -2.772566 -4.639447 2.540556
C  -1.958475 -3.437726 0.426264
C  -0.05332 -0.672509 -0.293392
C  1.363452 -0.271643 -0.112757
C  2.439808 -0.905926 -0.740085
C  1.632697 0.760789 0.766121
C  -0.662169 1.318294 -1.583447
C  -1.855732 2.205745 -1.857594
C  3.73941 -0.514734 -0.450439
C  2.20923 -1.985685 -1.760329
C  -2.267839 2.927305 -0.597941
C  2.928538 1.16393 1.028582
C  3.990024 0.520475 0.4357
C  -3.44014 2.590663 0.071545
C  -1.453113 3.926786 -0.069112
C  -3.798203 3.24522 1.243334
C  -1.809152 4.580838 1.100777
C  -2.98427 4.242421 1.760386
H  -0.969281 -3.383207 2.381464
H  -4.012617 -2.830649 2.183778
H  -2.993207 -2.747677 3.688383
H  -3.387449 -5.247319 1.88715
H  -2.36421 -5.174746 3.388061
H  -2.954585 -3.662096 0.039499
H  -1.255154 -4.133463 -0.041174
H  -1.938003 0.043832 -0.621537
H  -2.685676 1.604223 -2.236142
H  -1.575604 2.913853 -2.637084
H  4.5835 -0.999432 -0.91867
H  5.003436 0.830526 0.652786
H  -4.083199 1.815295 -0.328585
H  -0.535092 4.198362 -0.577528
H  -4.715978 2.975298 1.750166
H  -1.168677 5.35779 1.49835
H  -3.263706 4.754939 2.672028
elementType: F O N C H
totalener: -1531.67123613 hartree
nucrepener: 2917.81173387 hartree
electener: -4449.48297000 hartree
oneelecener: -7906.12750734 hartree
twoeener: 3456.64453734 hartree
cpcmener: -0.03190673 hartree
kineticenergy: 1525.77531065 hartree
xcener: -138.185294884035 hartree
chargesum: -0.0000000
charge: -0.200344 -0.176832 -0.171162 -0.177529 -0.197797 -0.252866 -0.451555 -0.171716 -0.165500 -0.088359 -0.180205 -0.189085 0.065970 0.287397 -0.056894 -0.141360 0.257123 0.317696 -0.071127 -0.073382 0.533306 0.036115 0.205807 -0.175120 -0.188250 -0.230110 -0.145311 -0.132965 -0.170590 0.090112 0.084549 0.094518 0.086332 0.093825 0.092611 0.086083 0.181399 0.121422 0.108737 0.149380 0.156900 0.142920 0.141997 0.157569 0.158014 0.158281
qa: -0.2003 -0.1768 -0.1712 -0.1775 -0.1978 -0.2529 -0.4516 -0.1717 -0.1655 -0.0884 -0.1802 -0.1891 0.0660 0.2874 -0.0569 -0.1414 0.2571 0.3177 -0.0711 -0.0734 0.5333 0.0361 0.2058 -0.1751 -0.1883 -0.2301 -0.1453 -0.1330 -0.1706 0.0901 0.0845 0.0945 0.0863 0.0938 0.0926 0.0861 0.1814 0.1214 0.1087 0.1494 0.1569 0.1429 0.1420 0.1576 0.1580 0.1583
va: 1.1037 1.1247 1.1224 1.1221 1.0994 1.9474 2.0401 2.8806 3.2539 3.7907 3.9055 3.9239 3.8952 3.8940 3.7911 3.7867 3.8695 4.1366 3.7782 3.8678 4.4504 3.5695 4.0246 3.9226 3.9333 3.9370 3.8972 3.8837 3.9107 1.0210 1.0176 1.0170 1.0164 1.0152 0.9961 1.0117 1.0259 1.0121 1.0233 1.0058 0.9954 1.0029 1.0118 0.9907 0.9901 0.9901
dispcorr: -0.022980823 hartree
energy: -1531.694216952424
dipole: -36.23591 35.02672 -1.20919 -0.23592 0.11647 -0.11945 15.04388 -14.35301 0.69087
magnitude: 1.39775 au
magnitude: 3.55281 debye
