program: Orca
programVersion: 5.0.4
elementType: F F F F F O O N N C C C C C C C C C C C C C C C C C C C C H H H H H H H H H H H H H H H H H
charge: 0
multiplicity: 1
keywords: wb97x-d3
keywords: def2-TZVPP
keywords: def2/J RIJCOSX
keywords: DEFGRID2
keywords: scfconv7
keywords: smallprint printgap noloewdin
keywords: NOSOSCF
formula: C20H17F5N2O2
InChI: InChI=1/C20H17F5N2O2/c21-15-9-8-14(20(23,24)25)17(18(15)22)19(27-29-11-13-6-7-13)26-16(28)10-12-4-2-1-3-5-12/h1-5,8-9,13,26H,6-7,10-11H2
46 atoms
F  1.56272 1.216842 -2.130449
F  2.720093 -1.96577 2.718066
F  0.82744 -1.037175 2.311841
F  1.383691 -2.846132 1.287277
F  4.235481 1.29267 -2.353765
O  -1.638964 -1.298213 -0.848118
O  1.056729 2.069367 1.144973
N  -0.274187 -1.308398 -0.812239
N  -0.554383 0.788476 0.186012
C  -1.964982 -3.644625 -0.293693
C  -2.945871 -3.743926 0.832988
C  -2.968809 -4.755235 -0.270245
C  -2.125196 -2.55531 -1.310148
C  0.21039 -0.256382 -0.285686
C  1.694229 -0.188155 -0.266345
C  2.491708 -0.869829 0.652326
C  2.311442 0.542948 -1.259263
C  -0.111659 1.875286 0.888154
C  -1.205591 2.80603 1.372168
C  3.873934 -0.809454 0.553061
C  1.856314 -1.678893 1.742776
C  -2.416105 2.898723 0.485445
C  3.688444 0.591867 -1.364165
C  4.477416 -0.080553 -0.459293
C  -2.383109 3.690998 -0.660895
C  -3.574744 2.182094 0.772741
C  -3.484946 3.767741 -1.498533
C  -4.678098 2.253412 -0.068388
C  -4.635959 3.04667 -1.205379
H  -0.939184 -3.918651 -0.071334
H  -3.748689 -3.01696 0.872112
H  -2.576572 -4.0507 1.803424
H  -3.786694 -4.717207 -0.980132
H  -2.611223 -5.75514 -0.061196
H  -3.181293 -2.38113 -1.526039
H  -1.630034 -2.81424 -2.250909
H  -1.550865 0.701459 0.033803
H  -0.749088 3.786619 1.510043
H  -1.492299 2.452497 2.367753
H  4.505152 -1.329448 1.258968
H  5.554914 -0.035506 -0.542371
H  -1.487944 4.254932 -0.896748
H  -3.616256 1.563544 1.662054
H  -3.446332 4.392218 -2.382088
H  -5.571775 1.690788 0.169175
H  -5.496566 3.107301 -1.859129
elementType: F O N C H
totalener: -1531.67190113 hartree
nucrepener: 2922.34246029 hartree
electener: -4454.01436142 hartree
oneelecener: -7914.91873747 hartree
twoeener: 3460.90437605 hartree
cpcmener: -0.02901634 hartree
kineticenergy: 1525.79819313 hartree
xcener: -138.190682582018 hartree
chargesum: -0.0000000
charge: -0.200639 -0.174340 -0.177830 -0.170797 -0.198288 -0.255083 -0.465250 -0.166693 -0.173167 -0.094574 -0.174424 -0.191965 0.071693 0.250625 -0.083006 -0.105125 0.257334 0.354181 -0.054811 -0.087109 0.535416 -0.013564 0.196796 -0.168914 -0.193346 -0.199297 -0.140834 -0.144737 -0.158860 0.089001 0.083321 0.092997 0.087916 0.094205 0.092248 0.085628 0.197508 0.109909 0.120405 0.150242 0.157497 0.143670 0.147368 0.157912 0.158115 0.158666
qa: -0.2006 -0.1743 -0.1778 -0.1708 -0.1983 -0.2551 -0.4653 -0.1667 -0.1732 -0.0946 -0.1744 -0.1920 0.0717 0.2506 -0.0830 -0.1051 0.2573 0.3542 -0.0548 -0.0871 0.5354 -0.0136 0.1968 -0.1689 -0.1933 -0.1993 -0.1408 -0.1447 -0.1589 0.0890 0.0833 0.0930 0.0879 0.0942 0.0922 0.0856 0.1975 0.1099 0.1204 0.1502 0.1575 0.1437 0.1474 0.1579 0.1581 0.1587
va: 1.1035 1.1297 1.1208 1.1217 1.0986 1.9436 2.0415 2.9211 3.2711 3.7904 3.9005 3.9360 3.8782 3.9558 3.8067 3.7361 3.9160 4.1213 3.8039 3.8931 4.4399 3.6148 4.0259 3.9139 3.9602 3.9114 3.8818 3.8903 3.9013 1.0213 1.0189 1.0178 1.0161 1.0150 0.9963 1.0145 1.0176 1.0195 1.0034 1.0058 0.9951 1.0024 1.0029 0.9904 0.9905 0.9900
dispcorr: -0.023163679 hartree
energy: -1531.695064807484
dipole: -40.03224 38.77471 -1.25753 -2.49326 2.34916 -0.14409 -2.81501 2.73906 -0.07595
magnitude: 1.26804 au
magnitude: 3.22309 debye
