program: Orca
programVersion: 5.0.4
elementType: F F F F F O O N N C C C C C C C C C C C C C C C C C C C C H H H H H H H H H H H H H H H H H
charge: 0
multiplicity: 1
keywords: wb97x-d3
keywords: def2-TZVPP
keywords: def2/J RIJCOSX
keywords: DEFGRID2
keywords: scfconv7
keywords: smallprint printgap noloewdin
keywords: NOSOSCF
formula: C20H17F5N2O2
InChI: InChI=1/C20H17F5N2O2/c21-15-9-8-14(20(23,24)25)17(18(15)22)19(27-29-11-13-6-7-13)26-16(28)10-12-4-2-1-3-5-12/h1-5,8-9,13,26H,6-7,10-11H2
46 atoms
F  0.911117 0.896347 1.728915
F  1.339927 -1.086792 -2.831535
F  3.37881 -1.756603 -2.9328
F  1.920697 -2.9301 -1.885446
F  3.462438 1.251996 2.499532
O  -1.65319 -1.82107 -0.495711
O  0.980285 2.008246 -1.408194
N  -0.327582 -1.715769 -0.146443
N  -0.616399 0.474824 -0.895678
C  -2.783498 -1.759237 1.644951
C  -3.023066 -2.441375 2.957204
C  -1.83531 -1.546858 2.785397
C  -2.374369 -2.585122 0.463991
C  0.146786 -0.567646 -0.430251
C  1.583779 -0.370183 -0.119468
C  2.622895 -0.916148 -0.87233
C  1.895876 0.354443 1.012417
C  -0.187778 1.726834 -1.246648
C  -1.31258 2.727959 -1.426812
C  3.938937 -0.740324 -0.469434
C  2.316569 -1.676307 -2.128975
C  -2.433695 2.548797 -0.438891
C  3.208616 0.538756 1.405398
C  4.235325 -0.013929 0.673209
C  -2.213931 2.802654 0.914732
C  -3.678281 2.072843 -0.838891
C  -3.215982 2.581232 1.846188
C  -4.684533 1.84896 0.093801
C  -4.455038 2.100927 1.43792
H  -3.445329 -0.930949 1.408851
H  -2.850449 -3.509748 3.011775
H  -3.849121 -2.095075 3.564695
H  -0.856313 -2.006775 2.727866
H  -1.846056 -0.581221 3.274915
H  -3.251434 -2.950449 -0.073713
H  -1.782162 -3.453127 0.772188
H  -1.616299 0.312872 -0.864378
H  -1.684986 2.625444 -2.450829
H  -0.872137 3.722689 -1.350801
H  4.756853 -1.157968 -1.03893
H  5.260828 0.129456 0.987151
H  -1.249621 3.174342 1.241972
H  -3.861878 1.868686 -1.887378
H  -3.030374 2.781125 2.89383
H  -5.646565 1.475012 -0.233029
H  -5.236142 1.92392 2.166159
elementType: F O N C H
totalener: -1531.66880385 hartree
nucrepener: 2989.72490821 hartree
electener: -4521.39371206 hartree
oneelecener: -8049.51484823 hartree
twoeener: 3528.12113617 hartree
cpcmener: -0.02989627 hartree
kineticenergy: 1525.78451855 hartree
xcener: -138.187168516792 hartree
chargesum: 0.0000000
charge: -0.205614 -0.176077 -0.174536 -0.171137 -0.197626 -0.273618 -0.454501 -0.169294 -0.162604 -0.088442 -0.206097 -0.160508 0.078606 0.249174 -0.038547 -0.139377 0.257988 0.334266 -0.057091 -0.079863 0.533847 0.002962 0.207332 -0.171607 -0.208883 -0.198535 -0.130817 -0.122707 -0.177773 0.078496 0.090454 0.096018 0.080775 0.091047 0.098926 0.085472 0.188242 0.119535 0.109890 0.150769 0.156362 0.140167 0.143866 0.157132 0.156813 0.157114
qa: -0.2056 -0.1761 -0.1745 -0.1711 -0.1976 -0.2736 -0.4545 -0.1693 -0.1626 -0.0884 -0.2061 -0.1605 0.0786 0.2492 -0.0385 -0.1394 0.2580 0.3343 -0.0571 -0.0799 0.5338 0.0030 0.2073 -0.1716 -0.2089 -0.1985 -0.1308 -0.1227 -0.1778 0.0785 0.0905 0.0960 0.0808 0.0910 0.0989 0.0855 0.1882 0.1195 0.1099 0.1508 0.1564 0.1402 0.1439 0.1571 0.1568 0.1571
va: 1.0912 1.1229 1.1292 1.1246 1.1004 1.9286 2.0496 2.8425 3.2561 3.7852 3.9524 3.8692 3.8553 3.8788 3.7708 3.7858 3.8295 4.1429 3.7794 3.8827 4.4589 3.6188 4.0603 3.9268 3.9420 3.9183 3.8343 3.8386 3.8728 1.0168 1.0159 1.0159 1.0291 1.0187 0.9992 1.0184 1.0304 1.0049 1.0210 1.0047 0.9952 1.0088 1.0036 0.9905 0.9905 0.9912
dispcorr: -0.026418685 hartree
energy: -1531.695222534724
dipole: -39.54723 38.21629 -1.33094 4.64522 -4.35534 0.28989 16.64710 -15.87655 0.77055
magnitude: 1.56499 au
magnitude: 3.97789 debye
