program: Orca
programVersion: 5.0.4
elementType: F F F F F O O N N C C C C C C C C C C C C C C C C C C C C H H H H H H H H H H H H H H H H H
charge: 0
multiplicity: 1
keywords: wb97x-d3
keywords: def2-TZVPP
keywords: def2/J RIJCOSX
keywords: DEFGRID2
keywords: scfconv7
keywords: smallprint printgap noloewdin
keywords: NOSOSCF
formula: C20H17F5N2O2
InChI: InChI=1/C20H17F5N2O2/c21-15-9-8-14(20(23,24)25)17(18(15)22)19(27-29-11-13-6-7-13)26-16(28)10-12-4-2-1-3-5-12/h1-5,8-9,13,26H,6-7,10-11H2
46 atoms
F  1.331119 0.827871 1.957089
F  1.660725 -2.820684 -1.884723
F  1.100275 -0.940871 -2.76273
F  3.068054 -1.741573 -3.090752
F  3.957473 1.095979 2.376065
O  -1.607618 -1.649109 0.146466
O  1.061746 1.987892 -1.325156
N  -0.248489 -1.594521 0.262877
N  -0.548268 0.559253 -0.593513
C  -2.129512 -2.55146 2.342516
C  -3.194103 -1.689208 2.947946
C  -3.231477 -3.172465 3.145086
C  -2.120847 -2.767981 0.861116
C  0.227021 -0.487224 -0.14613
C  1.699667 -0.345291 -0.035202
C  2.608597 -0.871437 -0.954465
C  2.186043 0.31242 1.074456
C  -0.109475 1.730893 -1.146683
C  -1.213193 2.678102 -1.573586
C  3.970871 -0.728391 -0.738477
C  2.1111 -1.594338 -2.172786
C  -2.46134 2.615855 -0.74006
C  3.54477 0.453933 1.286527
C  4.444281 -0.063977 0.383411
C  -3.568811 1.883982 -1.159941
C  -2.509497 3.259031 0.495539
C  -4.702137 1.793499 -0.361531
C  -3.641562 3.174686 1.291281
C  -4.741187 2.439331 0.865417
H  -1.153087 -2.518041 2.814805
H  -3.925271 -1.243455 2.283586
H  -2.924761 -1.066944 3.791892
H  -3.988375 -3.738705 2.615541
H  -2.984566 -3.567923 4.122021
H  -3.138299 -2.89364 0.485471
H  -1.551404 -3.662909 0.593164
H  -1.548358 0.436485 -0.49441
H  -1.439599 2.439844 -2.617779
H  -0.788401 3.682342 -1.568405
H  4.692602 -1.126825 -1.436788
H  5.50728 0.049336 0.549201
H  -3.545546 1.381272 -2.119999
H  -1.653973 3.830916 0.835805
H  -5.555258 1.221257 -0.702927
H  -3.666414 3.682996 2.246694
H  -5.624588 2.373879 1.487307
elementType: F O N C H
totalener: -1531.67186613 hartree
nucrepener: 2928.75600606 hartree
electener: -4460.42787219 hartree
oneelecener: -7927.76161315 hartree
twoeener: 3467.33374097 hartree
cpcmener: -0.02938724 hartree
kineticenergy: 1525.79458522 hartree
xcener: -138.189949990207 hartree
chargesum: -0.0000000
charge: -0.201621 -0.172222 -0.176709 -0.174497 -0.198191 -0.257320 -0.466127 -0.178898 -0.173690 -0.087879 -0.174250 -0.193679 0.068467 0.266965 -0.080214 -0.113954 0.264604 0.351174 -0.051512 -0.086598 0.531810 -0.016909 0.193301 -0.166702 -0.193936 -0.192824 -0.148866 -0.138583 -0.161994 0.090735 0.081530 0.093880 0.087009 0.094772 0.094044 0.087879 0.195520 0.119794 0.110216 0.150927 0.157132 0.147344 0.144485 0.158405 0.158210 0.158974
qa: -0.2016 -0.1722 -0.1767 -0.1745 -0.1982 -0.2573 -0.4661 -0.1789 -0.1737 -0.0879 -0.1742 -0.1937 0.0685 0.2670 -0.0802 -0.1140 0.2646 0.3512 -0.0515 -0.0866 0.5318 -0.0169 0.1933 -0.1667 -0.1939 -0.1928 -0.1489 -0.1386 -0.1620 0.0907 0.0815 0.0939 0.0870 0.0948 0.0940 0.0879 0.1955 0.1198 0.1102 0.1509 0.1571 0.1473 0.1445 0.1584 0.1582 0.1590
va: 1.1035 1.1239 1.1214 1.1297 1.0989 1.9417 2.0401 2.8861 3.2750 3.7788 3.8990 3.9382 3.8740 3.8983 3.8289 3.7433 3.9025 4.1238 3.8067 3.8931 4.4585 3.6234 4.0301 3.9135 3.9014 3.9592 3.8850 3.8781 3.8944 1.0180 1.0196 1.0173 1.0163 1.0148 0.9972 1.0153 1.0206 1.0036 1.0198 1.0052 0.9950 1.0029 1.0023 0.9906 0.9903 0.9900
dispcorr: -0.023439207 hartree
energy: -1531.695305336060
dipole: -41.64402 40.36225 -1.28177 2.77497 -2.75479 0.02018 15.42126 -15.00842 0.41283
magnitude: 1.34676 au
magnitude: 3.42319 debye
