program: Orca
programVersion: 5.0.4
elementType: F F F F F O O N N C C C C C C C C C C C C C C C C C C C C H H H H H H H H H H H H H H H H H
charge: 0
multiplicity: 1
keywords: wb97x-d3
keywords: def2-TZVPP
keywords: def2/J RIJCOSX
keywords: DEFGRID2
keywords: scfconv7
keywords: smallprint printgap noloewdin
keywords: NOSOSCF
formula: C20H17F5N2O2
InChI: InChI=1/C20H17F5N2O2/c21-15-9-8-14(20(23,24)25)17(18(15)22)19(27-29-11-13-6-7-13)26-16(28)10-12-4-2-1-3-5-12/h1-5,8-9,13,26H,6-7,10-11H2
46 atoms
F  1.250171 0.974743 1.845878
F  1.14087 -1.082428 -2.748619
F  3.12304 -1.87659 -2.991214
F  1.703311 -2.906635 -1.755962
F  3.868608 1.3487 2.263602
O  -1.615265 -1.701336 -0.004387
O  0.996491 1.937336 -1.484343
N  -0.26188 -1.625765 0.163081
N  -0.583136 0.551204 -0.62125
C  -2.215663 -2.761526 2.102367
C  -3.345206 -1.993861 2.716769
C  -3.319777 -3.487386 2.808086
C  -2.13214 -2.876038 0.610868
C  0.204197 -0.496469 -0.194414
C  1.671043 -0.323478 -0.055411
C  2.60669 -0.894308 -0.91958
C  2.12878 0.422152 1.010597
C  -0.164001 1.70634 -1.221764
C  -1.284439 2.663528 -1.578762
C  3.962913 -0.711728 -0.694979
C  2.144232 -1.692348 -2.102655
C  -2.411126 2.697784 -0.583807
C  3.481233 0.612138 1.225602
C  4.405668 0.045229 0.378732
C  -3.612526 2.040887 -0.833447
C  -2.244334 3.356345 0.633334
C  -4.625113 2.032274 0.118137
C  -3.255317 3.353595 1.581484
C  -4.448118 2.687201 1.327597
H  -1.261076 -2.717754 2.616729
H  -4.070121 -1.534981 2.054557
H  -3.142402 -1.423629 3.614411
H  -4.025608 -4.046451 2.205003
H  -3.097834 -3.942845 3.764524
H  -3.127975 -2.998606 0.179942
H  -1.529196 -3.73869 0.312255
H  -1.578159 0.429119 -0.481517
H  -1.655075 2.364899 -2.564341
H  -0.835741 3.650195 -1.697466
H  4.699818 -1.147617 -1.353848
H  5.463128 0.194633 0.551587
H  -3.75701 1.52847 -1.77764
H  -1.314076 3.87309 0.840217
H  -5.553036 1.514867 -0.089369
H  -3.111975 3.870017 2.522053
H  -5.236248 2.681968 2.069653
elementType: F O N C H
totalener: -1531.67189633 hartree
nucrepener: 2927.67050864 hartree
electener: -4459.34240496 hartree
oneelecener: -7925.61319429 hartree
twoeener: 3466.27078933 hartree
cpcmener: -0.02963026 hartree
kineticenergy: 1525.79159446 hartree
xcener: -138.189108453411 hartree
chargesum: -0.0000000
charge: -0.201777 -0.176485 -0.175147 -0.171228 -0.198330 -0.255755 -0.462512 -0.176899 -0.174086 -0.086937 -0.175053 -0.192749 0.066599 0.263386 -0.078451 -0.120842 0.268553 0.346324 -0.058866 -0.085376 0.532745 -0.011042 0.197944 -0.166240 -0.195469 -0.199191 -0.147002 -0.134040 -0.162761 0.090725 0.081709 0.093719 0.086764 0.094858 0.093370 0.088188 0.196473 0.120667 0.109464 0.151267 0.156928 0.147744 0.143591 0.158040 0.158559 0.158623
qa: -0.2018 -0.1765 -0.1751 -0.1712 -0.1983 -0.2558 -0.4625 -0.1769 -0.1741 -0.0869 -0.1751 -0.1927 0.0666 0.2634 -0.0785 -0.1208 0.2686 0.3463 -0.0589 -0.0854 0.5327 -0.0110 0.1979 -0.1662 -0.1955 -0.1992 -0.1470 -0.1340 -0.1628 0.0907 0.0817 0.0937 0.0868 0.0949 0.0934 0.0882 0.1965 0.1207 0.1095 0.1513 0.1569 0.1477 0.1436 0.1580 0.1586 0.1586
va: 1.1027 1.1220 1.1284 1.1243 1.0985 1.9445 2.0438 2.8846 3.2695 3.7798 3.9013 3.9357 3.8806 3.9024 3.8209 3.7539 3.8892 4.1293 3.7965 3.8853 4.4550 3.6208 4.0287 3.9148 3.9005 3.9569 3.8801 3.8780 3.8977 1.0179 1.0195 1.0173 1.0162 1.0148 0.9970 1.0142 1.0171 1.0034 1.0206 1.0053 0.9952 1.0026 1.0029 0.9907 0.9899 0.9900
dispcorr: -0.023345357 hartree
energy: -1531.695241684083
dipole: -41.53221 40.25382 -1.27839 2.01887 -2.02212 -0.00326 15.24704 -14.71032 0.53672
magnitude: 1.38649 au
magnitude: 3.52418 debye
