program: Orca
programVersion: 5.0.4
elementType: F F F F F O O N N C C C C C C C C C C C C C C C C C C C C H H H H H H H H H H H H H H H H H
charge: 0
multiplicity: 1
keywords: wb97x-d3
keywords: def2-TZVPP
keywords: def2/J RIJCOSX
keywords: DEFGRID2
keywords: scfconv7
keywords: smallprint printgap noloewdin
keywords: NOSOSCF
formula: C20H17F5N2O2
InChI: InChI=1/C20H17F5N2O2/c21-15-9-8-14(20(23,24)25)17(18(15)22)19(27-29-11-13-6-7-13)26-16(28)10-12-4-2-1-3-5-12/h1-5,8-9,13,26H,6-7,10-11H2
46 atoms
F  1.2698 0.831627 1.925512
F  1.717016 -2.839999 -1.882109
F  1.176585 -0.966938 -2.788173
F  3.154759 -1.764659 -3.055359
F  3.885283 1.138313 2.396398
O  -1.61468 -1.676476 0.051663
O  1.055122 1.955966 -1.399714
N  -0.256886 -1.623028 0.202543
N  -0.547844 0.537822 -0.635147
C  -2.23993 -2.494239 2.257238
C  -3.330821 -1.611277 2.781354
C  -3.379394 -3.086378 3.029061
C  -2.160029 -2.767571 0.785708
C  0.225055 -0.511107 -0.187783
C  1.694728 -0.35734 -0.046358
C  2.631144 -0.879517 -0.94016
C  2.14992 0.318338 1.066437
C  -0.113048 1.709325 -1.191007
C  -1.223309 2.669741 -1.571911
C  3.986769 -0.714319 -0.698425
C  2.171483 -1.613813 -2.165777
C  -2.432887 2.611912 -0.681676
C  3.501988 0.480819 1.304985
C  4.427471 -0.032017 0.425587
C  -3.584395 1.936229 -1.075728
C  -2.394742 3.194604 0.584132
C  -4.674972 1.837159 -0.220401
C  -3.483016 3.100367 1.437365
C  -4.626027 2.417337 1.038557
H  -1.284951 -2.443191 2.770347
H  -4.031222 -1.187963 2.070764
H  -3.10001 -0.960674 3.615378
H  -4.11139 -3.670799 2.484063
H  -3.181386 -3.44876 4.029626
H  -3.158759 -2.910948 0.368196
H  -1.577706 -3.67085 0.581828
H  -1.54624 0.414975 -0.521159
H  -1.498809 2.438783 -2.605781
H  -0.789537 3.670239 -1.580233
H  4.725691 -1.10887 -1.380674
H  5.484857 0.099533 0.612814
H  -3.62879 1.480625 -2.05829
H  -1.504273 3.723847 0.903667
H  -5.562431 1.306604 -0.541105
H  -3.439547 3.559005 2.416991
H  -5.47474 2.341745 1.706124
elementType: F O N C H
totalener: -1531.67187691 hartree
nucrepener: 2934.10910801 hartree
electener: -4465.78098492 hartree
oneelecener: -7938.45947160 hartree
twoeener: 3472.67848668 hartree
cpcmener: -0.02954285 hartree
kineticenergy: 1525.77627220 hartree
xcener: -138.186282015852 hartree
chargesum: 0.0000000
charge: -0.201949 -0.172335 -0.175974 -0.174646 -0.198263 -0.258542 -0.464912 -0.178912 -0.172390 -0.086449 -0.175826 -0.193873 0.068723 0.264475 -0.077425 -0.116221 0.264135 0.349019 -0.053274 -0.084685 0.531241 -0.015162 0.195724 -0.166496 -0.191575 -0.197677 -0.146782 -0.132767 -0.166913 0.090894 0.082054 0.093966 0.087089 0.094930 0.094351 0.088348 0.194922 0.119058 0.110361 0.151080 0.157113 0.146027 0.144080 0.158331 0.158235 0.158887
qa: -0.2019 -0.1723 -0.1760 -0.1746 -0.1983 -0.2585 -0.4649 -0.1789 -0.1724 -0.0864 -0.1758 -0.1939 0.0687 0.2645 -0.0774 -0.1162 0.2641 0.3490 -0.0533 -0.0847 0.5312 -0.0152 0.1957 -0.1665 -0.1916 -0.1977 -0.1468 -0.1328 -0.1669 0.0909 0.0821 0.0940 0.0871 0.0949 0.0944 0.0883 0.1949 0.1191 0.1104 0.1511 0.1571 0.1460 0.1441 0.1583 0.1582 0.1589
va: 1.1027 1.1241 1.1221 1.1294 1.0989 1.9418 2.0416 2.8840 3.2719 3.7780 3.8968 3.9414 3.8734 3.9040 3.8267 3.7465 3.8997 4.1250 3.8023 3.8887 4.4589 3.6278 4.0297 3.9142 3.9026 3.9597 3.8757 3.8706 3.8929 1.0174 1.0195 1.0175 1.0163 1.0148 0.9972 1.0153 1.0209 1.0040 1.0199 1.0052 0.9950 1.0032 1.0025 0.9906 0.9901 0.9902
dispcorr: -0.023762249 hartree
energy: -1531.695639155759
dipole: -42.10804 40.82329 -1.28475 3.12767 -3.07135 0.05632 15.43050 -14.91463 0.51588
magnitude: 1.38560 au
magnitude: 3.52191 debye
