program: Orca
programVersion: 5.0.4
elementType: F F F F F O O N N C C C C C C C C C C C C C C C C C C C C H H H H H H H H H H H H H H H H H
charge: 0
multiplicity: 1
keywords: wb97x-d3
keywords: def2-TZVPP
keywords: def2/J RIJCOSX
keywords: DEFGRID2
keywords: scfconv7
keywords: smallprint printgap noloewdin
keywords: NOSOSCF
formula: C20H17F5N2O2
InChI: InChI=1/C20H17F5N2O2/c21-15-9-8-14(20(23,24)25)17(18(15)22)19(27-29-11-13-6-7-13)26-16(28)10-12-4-2-1-3-5-12/h1-5,8-9,13,26H,6-7,10-11H2
46 atoms
F  1.228403 0.871625 1.846707
F  1.226583 -0.997926 -2.832301
F  3.213029 -1.7893 -3.058737
F  1.761775 -2.859805 -1.899681
F  3.834986 1.241374 2.331341
O  -1.587215 -1.749775 -0.06802
O  0.996536 1.963957 -1.43423
N  -0.233139 -1.671132 0.117018
N  -0.565026 0.497286 -0.676586
C  -2.285222 -2.340198 2.182376
C  -3.363234 -1.367968 2.553061
C  -3.476881 -2.802319 2.964194
C  -2.153945 -2.766103 0.751378
C  0.229802 -0.541816 -0.247683
C  1.693868 -0.355621 -0.092141
C  2.648506 -0.880392 -0.965026
C  2.126175 0.354082 1.008835
C  -0.160797 1.697098 -1.192941
C  -1.296209 2.661332 -1.479648
C  3.998646 -0.688332 -0.712769
C  2.213844 -1.634574 -2.187702
C  -2.450586 2.556954 -0.52204
C  3.47291 0.547323 1.255348
C  4.415965 0.027007 0.399337
C  -3.638021 1.930706 -0.889609
C  -2.319685 3.04027 0.779135
C  -4.67253 1.781235 0.026098
C  -3.351567 2.895337 1.692992
C  -4.531057 2.261482 1.319675
H  -1.350937 -2.261664 2.728944
H  -4.016909 -1.009652 1.766108
H  -3.143943 -0.630996 3.315268
H  -4.207908 -3.421143 2.457254
H  -3.33265 -3.053412 4.007145
H  -3.137312 -2.955546 0.315937
H  -1.563315 -3.682382 0.659954
H  -1.558718 0.353151 -0.547178
H  -1.629513 2.466763 -2.503876
H  -0.8704 3.665326 -1.474835
H  4.751003 -1.085975 -1.378261
H  5.468979 0.180695 0.594113
H  -3.753524 1.550519 -1.898053
H  -1.40008 3.529907 1.078965
H  -5.588227 1.287783 -0.27392
H  -3.235169 3.274882 2.700111
H  -5.335142 2.144418 2.03481
elementType: F O N C H
totalener: -1531.67126091 hartree
nucrepener: 2949.73433881 hartree
electener: -4481.40559972 hartree
oneelecener: -7969.67075206 hartree
twoeener: 3488.26515234 hartree
cpcmener: -0.02967812 hartree
kineticenergy: 1525.78040751 hartree
xcener: -138.186907987490 hartree
chargesum: 0.0000000
charge: -0.202458 -0.175976 -0.174750 -0.171491 -0.198181 -0.262366 -0.462829 -0.180452 -0.169410 -0.083071 -0.182466 -0.192933 0.072401 0.261437 -0.071576 -0.125117 0.266842 0.345191 -0.056912 -0.083731 0.533466 -0.009830 0.198164 -0.166296 -0.189181 -0.205137 -0.141517 -0.119378 -0.182591 0.090865 0.084254 0.093996 0.088073 0.095213 0.093640 0.088962 0.193357 0.119162 0.110487 0.151588 0.156953 0.145548 0.143507 0.158033 0.158232 0.158282
qa: -0.2025 -0.1760 -0.1748 -0.1715 -0.1982 -0.2624 -0.4628 -0.1805 -0.1694 -0.0831 -0.1825 -0.1929 0.0724 0.2614 -0.0716 -0.1251 0.2668 0.3452 -0.0569 -0.0837 0.5335 -0.0098 0.1982 -0.1663 -0.1892 -0.2051 -0.1415 -0.1194 -0.1826 0.0909 0.0843 0.0940 0.0881 0.0952 0.0936 0.0890 0.1934 0.1192 0.1105 0.1516 0.1570 0.1455 0.1435 0.1580 0.1582 0.1583
va: 1.1010 1.1222 1.1292 1.1254 1.0991 1.9389 2.0434 2.8783 3.2658 3.7719 3.8838 3.9527 3.8735 3.9039 3.8107 3.7638 3.8854 4.1304 3.7969 3.8833 4.4566 3.6249 4.0338 3.9163 3.9012 3.9610 3.8454 3.8430 3.8800 1.0170 1.0205 1.0184 1.0162 1.0149 0.9977 1.0157 1.0229 1.0043 1.0201 1.0050 0.9951 1.0030 1.0032 0.9906 0.9896 0.9909
dispcorr: -0.024716748 hartree
energy: -1531.695977656259
dipole: -42.37539 41.08973 -1.28567 3.69075 -3.60233 0.08841 16.25827 -15.59071 0.66756
magnitude: 1.45134 au
magnitude: 3.68903 debye
