program: Orca
programVersion: 5.0.2
elementType: F F F F F O O N N C C C C C C C C C C C C C C C C C C C C H H H H H H H H H H H H H H H H H
charge: 0
multiplicity: 1
keywords: wb97x-d3
keywords: def2-TZVPP
keywords: def2/J RIJCOSX
keywords: DEFGRID2
keywords: scfconv7
keywords: smallprint printgap noloewdin
keywords: NOSOSCF
formula: C20H17F5N2O2
InChI: InChI=1/C20H17F5N2O2/c21-15-9-8-14(20(23,24)25)17(18(15)22)19(27-29-11-13-6-7-13)26-16(28)10-12-4-2-1-3-5-12/h1-5,8-9,13,26H,6-7,10-11H2
46 atoms
F  0.972393 -0.302563 -2.382429
F  1.437513 0.511002 2.535121
F  1.894684 -1.581767 2.741376
F  3.445502 -0.11525 2.97549
F  3.511901 -0.614383 -3.2088
O  -1.667209 -1.200409 0.941525
O  1.253571 2.320785 -0.248323
N  -0.356696 -1.385063 0.596773
N  -0.480336 0.900064 0.135518
C  -2.685033 -3.0624 -0.241241
C  -1.674923 -3.875145 -0.987833
C  -2.832246 -4.552041 -0.326272
C  -2.324768 -2.44755 1.077048
C  0.194335 -0.298282 0.232721
C  1.62774 -0.391881 -0.138678
C  2.656723 -0.493833 0.795534
C  1.942545 -0.42647 -1.481991
C  0.076663 2.135254 -0.066922
C  -0.914128 3.291645 0.000381
C  3.96657 -0.648466 0.367587
C  2.355285 -0.423157 2.265374
C  -2.349612 2.945613 -0.272605
C  3.249709 -0.579115 -1.906113
C  4.266096 -0.69591 -0.983935
C  -3.229185 2.665164 0.769388
C  -2.81481 2.853157 -1.582007
C  -4.541658 2.296167 0.510833
C  -4.12656 2.492274 -1.843003
C  -4.993676 2.21053 -0.79647
H  -3.374176 -2.475683 -0.839991
H  -0.693506 -3.98537 -0.546332
H  -1.667651 -3.805889 -2.067338
H  -2.639894 -5.136435 0.565468
H  -3.624279 -4.952086 -0.94484
H  -1.704037 -3.130132 1.667187
H  -3.223292 -2.225051 1.65628
H  -1.479533 0.841459 0.273493
H  -0.553639 4.0521 -0.693136
H  -0.812003 3.723713 1.000477
H  4.773011 -0.724516 1.081751
H  5.285416 -0.813929 -1.324613
H  -2.884803 2.736491 1.794621
H  -2.142216 3.066448 -2.404306
H  -5.211059 2.080281 1.332895
H  -4.473484 2.430788 -2.865981
H  -6.017694 1.927598 -1.000664
totalener: -1531.64780675 hartree
nucrepener: 2934.12985717 hartree
electener: -4465.77766392 hartree
oneelecener: -7937.62776394 hartree
twoeener: 3471.85010002 hartree
kineticenergy: 1525.84588932 hartree
xcener: -138.195862546912 hartree
chargesum: -0.0000000
charge: -0.189849 -0.170593 -0.158848 -0.173199 -0.183816 -0.238327 -0.371854 -0.143981 -0.189398 -0.060412 -0.120528 -0.170029 0.025140 0.270823 -0.078496 -0.100792 0.271896 0.313443 -0.103427 -0.081014 0.527479 -0.010006 0.168836 -0.157347 -0.184765 -0.153524 -0.115816 -0.112705 -0.123301 0.066613 0.071996 0.077362 0.067408 0.077391 0.080307 0.085927 0.179433 0.112880 0.102694 0.130407 0.128844 0.124240 0.120720 0.129287 0.129782 0.129118
qa: -0.1898 -0.1706 -0.1588 -0.1732 -0.1838 -0.2383 -0.3719 -0.1440 -0.1894 -0.0604 -0.1205 -0.1700 0.0251 0.2708 -0.0785 -0.1008 0.2719 0.3134 -0.1034 -0.0810 0.5275 -0.0100 0.1688 -0.1573 -0.1848 -0.1535 -0.1158 -0.1127 -0.1233 0.0666 0.0720 0.0774 0.0674 0.0774 0.0803 0.0859 0.1794 0.1129 0.1027 0.1304 0.1288 0.1242 0.1207 0.1293 0.1298 0.1291
va: 1.1192 1.1315 1.1422 1.1296 1.1178 1.9626 2.1353 2.8767 3.2647 3.7961 3.8871 3.9455 3.9392 3.8651 3.8677 3.8190 3.8795 4.1480 3.8283 3.9215 4.4593 3.6387 4.0776 3.9261 3.9634 4.0144 3.9550 3.9495 3.9570 1.0171 1.0374 1.0215 1.0205 1.0200 1.0143 1.0022 1.0369 1.0194 1.0086 1.0144 1.0058 1.0091 1.0094 1.0003 0.9999 0.9993
dispcorr: -0.023463745 hartree
energy: -1531.671270496492
dipole: -39.52889 38.32207 -1.20681 -4.05255 4.04557 -0.00697 -5.92479 5.78017 -0.14462
magnitude: 1.21547 au
magnitude: 3.08948 debye
