program: Orca
programVersion: 5.0.2
elementType: F F F F F O O N N C C C C C C C C C C C C C C C C C C C C H H H H H H H H H H H H H H H H H
charge: 0
multiplicity: 1
keywords: wb97x-d3
keywords: def2-TZVPP
keywords: def2/J RIJCOSX
keywords: DEFGRID2
keywords: scfconv7
keywords: smallprint printgap noloewdin
keywords: NOSOSCF
formula: C20H17F5N2O2
InChI: InChI=1/C20H17F5N2O2/c21-15-9-8-14(20(23,24)25)17(18(15)22)19(27-29-11-13-6-7-13)26-16(28)10-12-4-2-1-3-5-12/h1-5,8-9,13,26H,6-7,10-11H2
46 atoms
F  1.222203 1.76031 1.339346
F  0.735199 -1.85628 -2.122516
F  2.718545 -2.664611 -2.277237
F  1.462467 -3.236289 -0.635948
F  3.866881 2.116028 1.496825
O  -1.829223 -1.257059 0.769681
O  0.754959 1.60968 -1.914541
N  -0.463905 -1.275229 0.75072
N  -0.77607 0.653186 -0.532837
C  -2.279029 -3.652038 0.750043
C  -1.065592 -4.51981 0.845032
C  -2.326661 -4.930775 1.533765
C  -2.342979 -2.356977 1.500471
C  0.007815 -0.31121 0.067803
C  1.484158 -0.173511 0.043299
C  2.34732 -1.057725 -0.602601
C  2.028992 0.888467 0.739268
C  -0.354195 1.588227 -1.443523
C  -1.430917 2.590391 -1.836187
C  3.719589 -0.875702 -0.509193
C  1.808608 -2.205141 -1.410182
C  -2.318943 3.012315 -0.698778
C  3.395406 1.075279 0.818123
C  4.249455 0.187341 0.203358
C  -1.811538 3.822366 0.314939
C  -3.635117 2.573209 -0.607381
C  -2.60209 4.182051 1.392791
C  -4.428794 2.928661 0.475435
C  -3.91336 3.733174 1.477864
H  -2.803965 -3.650591 -0.1995
H  -0.242476 -4.165257 1.450229
H  -0.760244 -5.062503 -0.03886
H  -2.36237 -4.867689 2.614786
H  -2.897254 -5.755506 1.128399
H  -1.825589 -2.442882 2.462353
H  -3.380499 -2.083957 1.704181
H  -1.735535 0.690658 -0.219341
H  -2.025033 2.141936 -2.638284
H  -0.916271 3.445426 -2.274521
H  4.397478 -1.555142 -1.004174
H  5.318342 0.334581 0.271874
H  -0.786914 4.170639 0.260242
H  -4.047645 1.94863 -1.391459
H  -2.193512 4.811358 2.172286
H  -5.450301 2.57658 0.531815
H  -4.528913 4.011461 2.32287
totalener: -1531.64631707 hartree
nucrepener: 2940.11198298 hartree
electener: -4471.75830005 hartree
oneelecener: -7949.67729953 hartree
twoeener: 3477.91899948 hartree
kineticenergy: 1525.84335126 hartree
xcener: -138.194541328612 hartree
chargesum: 0.0000000
charge: -0.191914 -0.169427 -0.174144 -0.159760 -0.183873 -0.233166 -0.358463 -0.127073 -0.186489 -0.042895 -0.124356 -0.171641 0.018961 0.257924 -0.058824 -0.107019 0.248098 0.294703 -0.115696 -0.071763 0.534175 0.006870 0.180415 -0.164035 -0.165286 -0.194435 -0.103629 -0.103088 -0.129233 0.066509 0.070241 0.077925 0.065178 0.077092 0.071262 0.086045 0.177284 0.101943 0.115833 0.129784 0.128487 0.119298 0.120791 0.130430 0.128330 0.128630
qa: -0.1919 -0.1694 -0.1741 -0.1598 -0.1839 -0.2332 -0.3585 -0.1271 -0.1865 -0.0429 -0.1244 -0.1716 0.0190 0.2579 -0.0588 -0.1070 0.2481 0.2947 -0.1157 -0.0718 0.5342 0.0069 0.1804 -0.1640 -0.1653 -0.1944 -0.1036 -0.1031 -0.1292 0.0665 0.0702 0.0779 0.0652 0.0771 0.0713 0.0860 0.1773 0.1019 0.1158 0.1298 0.1285 0.1193 0.1208 0.1304 0.1283 0.1286
va: 1.1132 1.1349 1.1285 1.1361 1.1184 1.9625 2.1434 2.9251 3.2472 3.7963 3.8833 3.9466 3.9519 3.9410 3.8449 3.8323 3.8588 4.1645 3.8014 3.9091 4.4358 3.6473 4.0851 3.9376 4.0060 3.9619 3.9396 3.9521 3.9677 1.0180 1.0371 1.0255 1.0202 1.0204 1.0144 1.0020 1.0327 1.0063 1.0202 1.0145 1.0059 1.0133 1.0093 0.9991 0.9995 0.9993
dispcorr: -0.023958002 hartree
energy: -1531.670275076405
dipole: -34.33429 33.35267 -0.98162 -1.40086 1.63010 0.22924 9.09521 -8.64190 0.45331
magnitude: 1.10527 au
magnitude: 2.80936 debye
