program: Orca
programVersion: 5.0.2
elementType: F F F F F O O N N C C C C C C C C C C C C C C C C C C C C H H H H H H H H H H H H H H H H H
charge: 0
multiplicity: 1
keywords: wb97x-d3
keywords: def2-TZVPP
keywords: def2/J RIJCOSX
keywords: DEFGRID2
keywords: scfconv7
keywords: smallprint printgap noloewdin
keywords: NOSOSCF
formula: C20H17F5N2O2
InChI: InChI=1/C20H17F5N2O2/c21-15-9-8-14(20(23,24)25)17(18(15)22)19(27-29-11-13-6-7-13)26-16(28)10-12-4-2-1-3-5-12/h1-5,8-9,13,26H,6-7,10-11H2
46 atoms
F  1.836572 1.246287 1.915344
F  0.557146 -1.150223 -2.347871
F  2.379733 -2.143906 -2.895743
F  1.141461 -2.972055 -1.355945
F  4.513038 1.214286 1.84011
O  -1.716352 -1.125009 0.589061
O  1.176856 2.232497 -0.992176
N  -0.361781 -1.265628 0.522107
N  -0.445744 1.021254 0.043414
C  -2.159861 -2.961815 2.137192
C  -2.243214 -4.451328 2.298584
C  -0.933156 -3.751488 2.466133
C  -2.335804 -2.388704 0.764676
C  0.220148 -0.176534 0.218953
C  1.696528 -0.23767 0.109043
C  2.361354 -1.020074 -0.836383
C  2.450525 0.49438 1.006135
C  0.064958 2.155635 -0.533224
C  -0.869657 3.358204 -0.504766
C  3.748681 -1.054381 -0.852034
C  1.600526 -1.822618 -1.856066
C  -2.337986 3.056524 -0.416121
C  3.831289 0.473772 0.972864
C  4.488243 -0.308675 0.049836
C  -3.01671 3.138257 0.795858
C  -3.042463 2.661702 -1.55136
C  -4.368935 2.835236 0.873668
C  -4.392196 2.359753 -1.477115
C  -5.059644 2.446362 -0.263135
H  -2.586976 -2.366072 2.937281
H  -2.390192 -5.053846 1.410107
H  -2.742052 -4.841867 3.17535
H  -0.186091 -3.861568 1.691553
H  -0.524787 -3.658723 3.463507
H  -3.391512 -2.201685 0.558704
H  -1.967236 -3.088658 0.006713
H  -1.425613 1.013038 0.28955
H  -0.644018 3.946879 -1.394713
H  -0.556319 3.968691 0.347557
H  4.274386 -1.653023 -1.580566
H  5.569147 -0.324061 0.031866
H  -2.484033 3.44803 1.687471
H  -2.527595 2.592326 -2.50231
H  -4.882481 2.907399 1.82325
H  -4.925092 2.057584 -2.368911
H  -6.114322 2.212528 -0.204993
totalener: -1531.64695784 hartree
nucrepener: 2925.50144512 hartree
electener: -4457.14840296 hartree
oneelecener: -7920.43819766 hartree
twoeener: 3463.28979470 hartree
kineticenergy: 1525.84722639 hartree
xcener: -138.196974548169 hartree
chargesum: 0.0000000
charge: -0.191980 -0.170431 -0.174780 -0.161200 -0.183453 -0.232345 -0.367222 -0.136226 -0.201349 -0.057839 -0.171356 -0.115592 0.022828 0.277054 -0.061866 -0.133900 0.265021 0.303149 -0.102685 -0.070926 0.535841 -0.021441 0.186169 -0.164634 -0.168324 -0.157375 -0.112563 -0.112925 -0.122801 0.066128 0.067006 0.076932 0.072723 0.074501 0.085251 0.075333 0.180901 0.116837 0.099687 0.130435 0.128550 0.119058 0.121403 0.128827 0.130267 0.129313
qa: -0.1920 -0.1704 -0.1748 -0.1612 -0.1835 -0.2323 -0.3672 -0.1362 -0.2013 -0.0578 -0.1714 -0.1156 0.0228 0.2771 -0.0619 -0.1339 0.2650 0.3031 -0.1027 -0.0709 0.5358 -0.0214 0.1862 -0.1646 -0.1683 -0.1574 -0.1126 -0.1129 -0.1228 0.0661 0.0670 0.0769 0.0727 0.0745 0.0853 0.0753 0.1809 0.1168 0.0997 0.1304 0.1285 0.1191 0.1214 0.1288 0.1303 0.1293
va: 1.1173 1.1349 1.1259 1.1339 1.1191 1.9617 2.1375 2.8818 3.2382 3.8027 3.9401 3.8876 3.9589 3.9008 3.8121 3.8582 3.8458 4.1645 3.8041 3.9038 4.4412 3.6478 4.0675 3.9369 3.9727 4.0222 3.9548 3.9479 3.9622 1.0156 1.0209 1.0201 1.0375 1.0217 1.0032 1.0116 1.0343 1.0188 1.0104 1.0147 1.0061 1.0104 1.0088 1.0001 0.9998 0.9992
dispcorr: -0.023206451 hartree
energy: -1531.670164291169
dipole: -36.21566 35.09289 -1.12277 -0.91524 1.02231 0.10707 11.48615 -11.10974 0.37641
magnitude: 1.18901 au
magnitude: 3.02223 debye
