program: Orca
programVersion: 5.0.2
elementType: F F F F F O O N N C C C C C C C C C C C C C C C C C C C C H H H H H H H H H H H H H H H H H
charge: 0
multiplicity: 1
keywords: wb97x-d3
keywords: def2-TZVPP
keywords: def2/J RIJCOSX
keywords: DEFGRID2
keywords: scfconv7
keywords: smallprint printgap noloewdin
keywords: NOSOSCF
formula: C20H17F5N2O2
InChI: InChI=1/C20H17F5N2O2/c21-15-9-8-14(20(23,24)25)17(18(15)22)19(27-29-11-13-6-7-13)26-16(28)10-12-4-2-1-3-5-12/h1-5,8-9,13,26H,6-7,10-11H2
46 atoms
F  1.548951 0.585124 2.131647
F  2.82819 -1.382099 -3.302739
F  1.326565 -2.46477 -2.222772
F  0.980113 -0.414329 -2.778156
F  4.210712 0.537147 2.434287
O  -1.700287 -1.35817 0.032557
O  1.24172 2.265245 -0.743283
N  -0.338669 -1.450569 0.099311
N  -0.470497 0.856125 -0.242203
C  -2.28999 -2.761168 1.930664
C  -2.346826 -4.154646 2.483507
C  -1.092886 -3.350368 2.607471
C  -2.29875 -2.575407 0.443517
C  0.224983 -0.32399 -0.072984
C  1.708307 -0.328945 -0.016208
C  2.519237 -0.804852 -1.046146
C  2.306016 0.116802 1.144663
C  0.064093 2.072617 -0.572636
C  -0.946101 3.204927 -0.728437
C  3.896073 -0.831527 -0.884955
C  1.90915 -1.270404 -2.338073
C  -2.373288 2.901714 -0.376881
C  3.679558 0.094838 1.299662
C  4.480958 -0.384458 0.288523
C  -2.841696 3.107887 0.918095
C  -3.24753 2.378025 -1.326174
C  -4.150929 2.80313 1.256196
C  -4.557141 2.069031 -0.990217
C  -5.012606 2.282068 0.302062
H  -2.835392 -2.00308 2.483342
H  -2.354537 -4.982372 1.784639
H  -2.943564 -4.328183 3.368751
H  -0.246981 -3.618585 1.988961
H  -0.822099 -2.965985 3.581668
H  -3.323067 -2.517296 0.070088
H  -1.806005 -3.416909 -0.055234
H  -1.473273 0.783832 -0.14182
H  -0.86853 3.539838 -1.766042
H  -0.56826 4.032552 -0.124573
H  4.534666 -1.193751 -1.676378
H  5.554336 -0.399869 0.416081
H  -2.173331 3.512461 1.668748
H  -2.899901 2.209013 -2.33867
H  -4.499527 2.975505 2.265833
H  -5.223324 1.665644 -1.741164
H  -6.035438 2.045823 0.563808
totalener: -1531.64794328 hartree
nucrepener: 2929.96786492 hartree
electener: -4461.61580820 hartree
oneelecener: -7929.33822467 hartree
twoeener: 3467.72241647 hartree
kineticenergy: 1525.84116082 hartree
xcener: -138.195148019591 hartree
chargesum: -0.0000000
charge: -0.190537 -0.173851 -0.158012 -0.170453 -0.183667 -0.235172 -0.377481 -0.142723 -0.186428 -0.058936 -0.171793 -0.119399 0.022323 0.267751 -0.068338 -0.112789 0.268561 0.311408 -0.085098 -0.074002 0.528037 -0.028769 0.170302 -0.158303 -0.158945 -0.174622 -0.114058 -0.114588 -0.121555 0.067034 0.067779 0.077199 0.072030 0.076862 0.086431 0.079615 0.178471 0.108057 0.107854 0.132261 0.128729 0.118122 0.122108 0.129981 0.129689 0.128916
qa: -0.1905 -0.1739 -0.1580 -0.1705 -0.1837 -0.2352 -0.3775 -0.1427 -0.1864 -0.0589 -0.1718 -0.1194 0.0223 0.2678 -0.0683 -0.1128 0.2686 0.3114 -0.0851 -0.0740 0.5280 -0.0288 0.1703 -0.1583 -0.1589 -0.1746 -0.1141 -0.1146 -0.1216 0.0670 0.0678 0.0772 0.0720 0.0769 0.0864 0.0796 0.1785 0.1081 0.1079 0.1323 0.1287 0.1181 0.1221 0.1300 0.1297 0.1289
va: 1.1186 1.1284 1.1438 1.1321 1.1183 1.9671 2.1326 2.8777 3.2617 3.7961 3.9455 3.8871 3.9459 3.8703 3.8450 3.8370 3.8759 4.1564 3.8105 3.9028 4.4601 3.6305 4.0772 3.9267 4.0079 3.9928 3.9521 3.9536 3.9615 1.0168 1.0205 1.0201 1.0372 1.0214 1.0020 1.0131 1.0378 1.0140 1.0183 1.0139 1.0060 1.0113 1.0097 1.0000 1.0004 0.9995
dispcorr: -0.023339640 hartree
energy: -1531.671282918118
dipole: -37.33861 36.16369 -1.17492 -1.25763 1.31250 0.05487 13.76724 -13.40744 0.35980
magnitude: 1.23000 au
magnitude: 3.12641 debye
