program: Orca
programVersion: 5.0.2
elementType: F F F F F O O N N C C C C C C C C C C C C C C C C C C C C H H H H H H H H H H H H H H H H H
charge: 0
multiplicity: 1
keywords: wb97x-d3
keywords: def2-TZVPP
keywords: def2/J RIJCOSX
keywords: DEFGRID2
keywords: scfconv7
keywords: smallprint printgap noloewdin
keywords: NOSOSCF
formula: C20H17F5N2O2
InChI: InChI=1/C20H17F5N2O2/c21-15-9-8-14(20(23,24)25)17(18(15)22)19(27-29-11-13-6-7-13)26-16(28)10-12-4-2-1-3-5-12/h1-5,8-9,13,26H,6-7,10-11H2
46 atoms
F  2.060035 1.406425 1.856436
F  0.346444 -1.353189 -1.994318
F  2.123378 -2.285171 -2.757406
F  1.194823 -3.045974 -0.97503
F  4.726592 1.382638 1.534165
O  -1.469143 -0.931974 1.423775
O  1.060949 1.902787 -1.419528
N  -0.128808 -1.060454 1.192466
N  -0.460836 0.874818 -0.077933
C  -1.971592 -3.296831 1.177452
C  -3.031492 -4.334835 1.384412
C  -3.068349 -3.455195 0.17364
C  -1.953794 -2.094979 2.073014
C  0.318762 -0.139835 0.440034
C  1.777107 -0.184089 0.16541
C  2.353385 -1.010747 -0.797224
C  2.598354 0.611488 0.937427
C  -0.064921 1.808559 -0.999171
C  -1.172861 2.725175 -1.505426
C  3.729681 -1.01705 -0.966545
C  1.50001 -1.92212 -1.632377
C  -2.43995 2.763975 -0.701328
C  3.970927 0.602465 0.767749
C  4.541964 -0.210073 -0.186086
C  -3.530976 1.968654 -1.040856
C  -2.533836 3.580729 0.423235
C  -4.68908 1.988727 -0.276272
C  -3.68913 3.604025 1.187666
C  -4.77055 2.806772 0.839721
H  -0.991648 -3.654723 0.882603
H  -3.770037 -4.164588 2.158721
H  -2.759658 -5.374822 1.263968
H  -3.830764 -2.687214 0.125266
H  -2.82126 -3.887752 -0.78656
H  -1.359326 -2.288818 2.971083
H  -2.967171 -1.835552 2.38851
H  -1.428849 0.869128 0.211692
H  -1.382675 2.408421 -2.531214
H  -0.733512 3.720641 -1.587477
H  4.189271 -1.647771 -1.713133
H  5.615168 -0.209727 -0.317336
H  -3.476562 1.329829 -1.914725
H  -1.693284 4.205647 0.701027
H  -5.529673 1.368318 -0.557753
H  -3.746234 4.247034 2.05594
H  -5.673495 2.825972 1.435305
totalener: -1531.64827737 hartree
nucrepener: 2934.62924569 hartree
electener: -4466.27752306 hartree
oneelecener: -7938.53718527 hartree
twoeener: 3472.25966222 hartree
kineticenergy: 1525.83257154 hartree
xcener: -138.193184633609 hartree
chargesum: 0.0000000
charge: -0.186790 -0.173448 -0.172062 -0.164403 -0.183335 -0.235911 -0.374637 -0.145296 -0.185799 -0.070030 -0.156125 -0.132562 0.061663 0.263567 -0.092778 -0.074563 0.269101 0.309171 -0.089494 -0.092249 0.533108 -0.022061 0.162448 -0.154781 -0.175428 -0.161851 -0.115476 -0.108419 -0.121931 0.083327 0.063094 0.077449 0.057311 0.077608 0.080039 0.067713 0.181729 0.102291 0.113469 0.130074 0.128454 0.119678 0.119662 0.129312 0.130009 0.129152
qa: -0.1868 -0.1734 -0.1721 -0.1644 -0.1833 -0.2359 -0.3746 -0.1453 -0.1858 -0.0700 -0.1561 -0.1326 0.0617 0.2636 -0.0928 -0.0746 0.2691 0.3092 -0.0895 -0.0922 0.5331 -0.0221 0.1624 -0.1548 -0.1754 -0.1619 -0.1155 -0.1084 -0.1219 0.0833 0.0631 0.0774 0.0573 0.0776 0.0800 0.0677 0.1817 0.1023 0.1135 0.1301 0.1285 0.1197 0.1197 0.1293 0.1300 0.1292
va: 1.1238 1.1287 1.1317 1.1310 1.1188 1.9593 2.1314 2.9331 3.2560 3.8102 3.9409 3.9101 3.9355 3.9369 3.8507 3.7872 3.9028 4.1496 3.8126 3.9467 4.4396 3.6340 4.0803 3.9243 3.9856 4.0171 3.9512 3.9487 3.9639 1.0248 1.0205 1.0198 1.0243 1.0233 1.0148 0.9985 1.0340 1.0125 1.0178 1.0147 1.0057 1.0106 1.0101 1.0001 0.9999 0.9993
dispcorr: -0.023538107 hartree
energy: -1531.671815472833
dipole: -40.20320 39.08295 -1.12025 -0.62984 0.70026 0.07042 6.83397 -6.71562 0.11834
magnitude: 1.12869 au
magnitude: 2.86889 debye
