program: Orca
programVersion: 5.0.2
elementType: F F F F F O O N N C C C C C C C C C C C C C C C C C C C C H H H H H H H H H H H H H H H H H
charge: 0
multiplicity: 1
keywords: wb97x-d3
keywords: def2-TZVPP
keywords: def2/J RIJCOSX
keywords: DEFGRID2
keywords: scfconv7
keywords: smallprint printgap noloewdin
keywords: NOSOSCF
formula: C20H17F5N2O2
InChI: InChI=1/C20H17F5N2O2/c21-15-9-8-14(20(23,24)25)17(18(15)22)19(27-29-11-13-6-7-13)26-16(28)10-12-4-2-1-3-5-12/h1-5,8-9,13,26H,6-7,10-11H2
46 atoms
F  2.434876 0.802635 2.268278
F  1.546734 -1.513266 -3.106143
F  0.648082 -2.541748 -1.448219
F  0.009904 -0.552253 -1.95255
F  5.019962 0.627629 1.583827
O  -1.393692 -0.761559 1.820851
O  1.237158 2.293999 -0.672112
N  -0.133259 -1.045799 1.368447
N  -0.324051 1.105228 0.482693
C  -2.689422 -2.650072 1.017265
C  -1.879415 -3.630707 0.230734
C  -2.968323 -4.118926 1.130812
C  -2.080489 -1.943417 2.189683
C  0.364643 -0.064463 0.731235
C  1.767937 -0.214969 0.270209
C  2.129752 -0.793819 -0.945613
C  2.76208 0.246293 1.107584
C  0.107276 2.165954 -0.271972
C  -0.960936 3.220348 -0.542442
C  3.467496 -0.888861 -1.295729
C  1.081512 -1.348321 -1.864812
C  -2.382625 2.742774 -0.461561
C  4.096319 0.156186 0.753142
C  4.45476 -0.410129 -0.449258
C  -3.195251 3.078379 0.616244
C  -2.898696 1.911834 -1.454717
C  -4.493494 2.594475 0.704953
C  -4.193861 1.428931 -1.369666
C  -4.99499 1.767441 -0.287071
H  -3.414771 -2.061413 0.464477
H  -0.854409 -3.793439 0.534938
H  -2.034976 -3.676898 -0.838462
H  -2.683829 -4.623377 2.046508
H  -3.878251 -4.50137 0.688239
H  -1.40428 -2.609445 2.735884
H  -2.856546 -1.610472 2.882131
H  -1.295278 1.086963 0.761692
H  -0.740901 3.628647 -1.530042
H  -0.790689 4.037528 0.16444
H  3.760154 -1.332324 -2.235887
H  5.498984 -0.474592 -0.722051
H  -2.808941 3.723602 1.396451
H  -2.27742 1.636645 -2.299042
H  -5.111858 2.866375 1.550153
H  -4.57983 0.785571 -2.149361
H  -6.006298 1.388794 -0.220031
totalener: -1531.64668303 hartree
nucrepener: 2975.92601731 hartree
electener: -4507.57270034 hartree
oneelecener: -8021.11388337 hartree
twoeener: 3513.54118303 hartree
kineticenergy: 1525.84416250 hartree
xcener: -138.194661422767 hartree
chargesum: -0.0000000
charge: -0.183738 -0.171658 -0.161281 -0.177851 -0.182388 -0.242840 -0.370122 -0.130942 -0.184879 -0.051492 -0.128392 -0.169824 0.032141 0.257520 -0.088616 -0.074836 0.267467 0.298581 -0.086776 -0.096648 0.542872 -0.018307 0.160307 -0.150673 -0.154597 -0.173015 -0.111384 -0.116676 -0.124269 0.064097 0.072370 0.076870 0.067564 0.075555 0.076928 0.087693 0.174660 0.115905 0.096612 0.131405 0.128766 0.115440 0.118998 0.129085 0.131099 0.129266
qa: -0.1837 -0.1717 -0.1613 -0.1779 -0.1824 -0.2428 -0.3701 -0.1309 -0.1849 -0.0515 -0.1284 -0.1698 0.0321 0.2575 -0.0886 -0.0748 0.2675 0.2986 -0.0868 -0.0966 0.5429 -0.0183 0.1603 -0.1507 -0.1546 -0.1730 -0.1114 -0.1167 -0.1243 0.0641 0.0724 0.0769 0.0676 0.0756 0.0769 0.0877 0.1747 0.1159 0.0966 0.1314 0.1288 0.1154 0.1190 0.1291 0.1311 0.1293
va: 1.1297 1.1335 1.1364 1.1192 1.1202 1.9584 2.1326 2.9136 3.2536 3.7855 3.8793 3.9512 3.9258 3.9491 3.8517 3.7764 3.9081 4.1481 3.8004 3.9533 4.4235 3.6620 4.0869 3.9219 3.9744 4.0069 3.9529 3.9332 3.9573 1.0174 1.0377 1.0256 1.0204 1.0203 1.0183 1.0008 1.0422 1.0190 1.0109 1.0140 1.0056 1.0116 1.0151 1.0001 0.9994 0.9991
dispcorr: -0.025054219 hartree
energy: -1531.671737251327
dipole: -38.28571 37.11418 -1.17153 -2.17789 2.19703 0.01914 5.65959 -5.77063 -0.11104
magnitude: 1.17693 au
magnitude: 2.99152 debye
