program: Orca
programVersion: 5.0.2
elementType: F F F F F O O N N C C C C C C C C C C C C C C C C C C C C H H H H H H H H H H H H H H H H H
charge: 0
multiplicity: 1
keywords: wb97x-d3
keywords: def2-TZVPP
keywords: def2/J RIJCOSX
keywords: DEFGRID2
keywords: scfconv7
keywords: smallprint printgap noloewdin
keywords: NOSOSCF
formula: C20H17F5N2O2
InChI: InChI=1/C20H17F5N2O2/c21-15-9-8-14(20(23,24)25)17(18(15)22)19(27-29-11-13-6-7-13)26-16(28)10-12-4-2-1-3-5-12/h1-5,8-9,13,26H,6-7,10-11H2
46 atoms
F  2.091445 1.86712 1.142822
F  1.464155 -3.316685 -0.067852
F  0.547392 -2.088522 -1.584451
F  2.377165 -3.135473 -1.998385
F  4.720269 1.967702 0.610206
O  -1.273896 -0.912155 1.580784
O  0.897035 1.45179 -1.848203
N  0.051905 -1.060671 1.292088
N  -0.369456 0.778717 -0.084188
C  -2.714141 -2.864779 1.58766
C  -3.641134 -2.305312 0.554539
C  -2.4993 -3.186894 0.144735
C  -1.772067 -1.982144 2.364839
C  0.450771 -0.19766 0.445805
C  1.892344 -0.22132 0.100724
C  2.511177 -1.270177 -0.579341
C  2.664863 0.854075 0.497937
C  -0.100599 1.556147 -1.179535
C  -1.161944 2.602371 -1.503402
C  3.873867 -1.22187 -0.834841
C  1.719415 -2.455737 -1.053175
C  -2.404394 2.58235 -0.661687
C  4.018819 0.906314 0.226355
C  4.631643 -0.134844 -0.434786
C  -3.484443 1.775682 -1.011543
C  -2.482139 3.330078 0.510668
C  -4.614616 1.717069 -0.210018
C  -3.610903 3.273765 1.31417
C  -4.679746 2.465848 0.956017
H  -3.115059 -3.666084 2.201149
H  -3.572953 -1.249721 0.321918
H  -4.645845 -2.704081 0.499742
H  -1.665452 -2.731918 -0.370257
H  -2.720674 -4.192199 -0.189063
H  -0.933008 -2.562573 2.75418
H  -2.300524 -1.536875 3.212881
H  -1.271562 0.875331 0.35944
H  -1.405141 2.480562 -2.560956
H  -0.661345 3.570882 -1.425586
H  4.36141 -2.026591 -1.364545
H  5.691597 -0.087643 -0.642591
H  -3.439215 1.186796 -1.920125
H  -1.648367 3.959075 0.799654
H  -5.445258 1.086441 -0.498203
H  -3.65453 3.860702 2.222009
H  -5.560659 2.42065 1.582218
totalener: -1531.64452183 hartree
nucrepener: 2970.19081098 hartree
electener: -4501.83533280 hartree
oneelecener: -8009.60443681 hartree
twoeener: 3507.76910401 hartree
kineticenergy: 1525.82611673 hartree
xcener: -138.194442167905 hartree
chargesum: 0.0000000
charge: -0.191552 -0.159476 -0.177812 -0.172955 -0.183268 -0.237746 -0.371913 -0.129333 -0.188913 -0.053559 -0.148413 -0.170526 0.056011 0.247382 -0.063780 -0.124988 0.258672 0.296983 -0.080425 -0.069180 0.541892 -0.013330 0.183861 -0.161708 -0.185343 -0.166852 -0.135769 -0.110717 -0.107585 0.062791 0.060516 0.075707 0.084959 0.076616 0.086250 0.082535 0.178266 0.110757 0.104986 0.130352 0.128505 0.122365 0.119780 0.136166 0.130251 0.129543
qa: -0.1916 -0.1595 -0.1778 -0.1730 -0.1833 -0.2377 -0.3719 -0.1293 -0.1889 -0.0536 -0.1484 -0.1705 0.0560 0.2474 -0.0638 -0.1250 0.2587 0.2970 -0.0804 -0.0692 0.5419 -0.0133 0.1839 -0.1617 -0.1853 -0.1669 -0.1358 -0.1107 -0.1076 0.0628 0.0605 0.0757 0.0850 0.0766 0.0863 0.0825 0.1783 0.1108 0.1050 0.1304 0.1285 0.1224 0.1198 0.1362 0.1303 0.1295
va: 1.1166 1.1387 1.1235 1.1298 1.1191 1.9727 2.1372 2.9190 3.2298 3.8380 3.8891 3.9330 3.9075 3.9219 3.8063 3.8502 3.8592 4.1701 3.7985 3.9095 4.4446 3.6052 4.0712 3.9372 3.9798 3.9981 3.9255 3.9586 3.9531 1.0166 1.0306 1.0211 1.0323 1.0233 1.0187 0.9929 1.0366 1.0176 1.0167 1.0152 1.0061 1.0107 1.0112 0.9977 0.9998 0.9989
dispcorr: -0.025550175 hartree
energy: -1531.670072002623
dipole: -41.30585 40.27655 -1.02931 3.77281 -3.50949 0.26332 6.53270 -6.05748 0.47522
magnitude: 1.16389 au
magnitude: 2.95838 debye
