program: Orca
programVersion: 5.0.2
elementType: F F F F F O O N N C C C C C C C C C C C C C C C C C C C C H H H H H H H H H H H H H H H H H
charge: 0
multiplicity: 1
keywords: wb97x-d3
keywords: def2-TZVPP
keywords: def2/J RIJCOSX
keywords: DEFGRID2
keywords: scfconv7
keywords: smallprint printgap noloewdin
keywords: NOSOSCF
formula: C20H17F5N2O2
InChI: InChI=1/C20H17F5N2O2/c21-15-9-8-14(20(23,24)25)17(18(15)22)19(27-29-11-13-6-7-13)26-16(28)10-12-4-2-1-3-5-12/h1-5,8-9,13,26H,6-7,10-11H2
46 atoms
F  1.111313 1.378748 -1.942953
F  1.458983 -1.337549 2.282943
F  1.949739 -2.989771 0.993272
F  3.466782 -2.103898 2.222878
F  3.672501 1.872424 -2.537585
O  -1.515107 -1.669583 -0.292672
O  1.097416 1.869008 1.389855
N  -0.175446 -1.544196 -0.518094
N  -0.510404 0.542284 0.481751
C  -3.450114 -2.984325 -0.540858
C  -4.078985 -4.325974 -0.319968
C  -3.947488 -3.365202 0.818443
C  -1.978229 -2.912507 -0.793377
C  0.277113 -0.437301 -0.086612
C  1.720734 -0.189591 -0.313551
C  2.736509 -0.855302 0.371475
C  2.067118 0.724502 -1.287738
C  -0.064812 1.647948 1.161696
C  -1.183005 2.565358 1.635498
C  4.06274 -0.601429 0.05737
C  2.398665 -1.82664 1.467533
C  -2.303638 2.729496 0.646126
C  3.390292 0.981461 -1.59287
C  4.394865 0.316036 -0.926628
C  -2.080245 3.412658 -0.547411
C  -3.560681 2.182792 0.877551
C  -3.090624 3.546888 -1.483843
C  -4.575262 2.312992 -0.061924
C  -4.342511 2.99585 -1.243862
H  -4.042518 -2.259893 -1.090026
H  -3.43919 -5.199734 -0.326973
H  -5.060816 -4.501968 -0.738104
H  -3.213096 -3.578851 1.584873
H  -4.841039 -2.881207 1.189357
H  -1.759104 -2.989537 -1.863221
H  -1.459201 -3.735649 -0.289132
H  -1.506558 0.420589 0.366627
H  -0.722804 3.524843 1.872102
H  -1.564806 2.163346 2.578958
H  4.858256 -1.107163 0.583884
H  5.428118 0.520678 -1.170239
H  -1.104196 3.839871 -0.74527
H  -3.752186 1.651763 1.802686
H  -2.901506 4.081001 -2.405472
H  -5.548326 1.88303 0.13491
H  -5.131509 3.100453 -1.97666
totalener: -1531.64721199 hartree
nucrepener: 2911.23549133 hartree
electener: -4442.88270332 hartree
oneelecener: -7891.76423669 hartree
twoeener: 3448.88153338 hartree
kineticenergy: 1525.84926003 hartree
xcener: -138.194634233617 hartree
chargesum: -0.0000000
charge: -0.191176 -0.168596 -0.157959 -0.174157 -0.183742 -0.228184 -0.358807 -0.139571 -0.181653 -0.066399 -0.163507 -0.130888 0.055999 0.257960 -0.072999 -0.110077 0.256575 0.302904 -0.117277 -0.067829 0.527450 -0.004722 0.177183 -0.159726 -0.163376 -0.180708 -0.105313 -0.106659 -0.128523 0.074167 0.070309 0.078797 0.070848 0.073761 0.076140 0.062702 0.173944 0.116406 0.101109 0.130881 0.127964 0.121398 0.118514 0.130297 0.127866 0.128674
qa: -0.1912 -0.1686 -0.1580 -0.1742 -0.1837 -0.2282 -0.3588 -0.1396 -0.1817 -0.0664 -0.1635 -0.1309 0.0560 0.2580 -0.0730 -0.1101 0.2566 0.3029 -0.1173 -0.0678 0.5275 -0.0047 0.1772 -0.1597 -0.1634 -0.1807 -0.1053 -0.1067 -0.1285 0.0742 0.0703 0.0788 0.0708 0.0738 0.0761 0.0627 0.1739 0.1164 0.1011 0.1309 0.1280 0.1214 0.1185 0.1303 0.1279 0.1287
va: 1.1148 1.1348 1.1430 1.1280 1.1182 1.9696 2.1431 2.9163 3.2549 3.8629 3.9403 3.8918 3.9467 3.9003 3.8716 3.8334 3.8701 4.1519 3.8023 3.8980 4.4610 3.6644 4.0815 3.9325 4.0067 3.9596 3.9406 3.9481 3.9655 1.0136 1.0220 1.0209 1.0241 1.0216 1.0068 1.0022 1.0342 1.0193 1.0066 1.0142 1.0061 1.0118 1.0101 0.9993 0.9998 0.9993
dispcorr: -0.022866792 hartree
energy: -1531.670078782884
dipole: -44.52009 43.29251 -1.22758 -1.66556 1.73715 0.07159 -1.66222 1.38160 -0.28062
magnitude: 1.26128 au
magnitude: 3.20591 debye
