program: Orca
programVersion: 5.0.2
elementType: F F F F F O O N N C C C C C C C C C C C C C C C C C C C C H H H H H H H H H H H H H H H H H
charge: 0
multiplicity: 1
keywords: wb97x-d3
keywords: def2-TZVPP
keywords: def2/J RIJCOSX
keywords: DEFGRID2
keywords: scfconv7
keywords: smallprint printgap noloewdin
keywords: NOSOSCF
formula: C20H17F5N2O2
InChI: InChI=1/C20H17F5N2O2/c21-15-9-8-14(20(23,24)25)17(18(15)22)19(27-29-11-13-6-7-13)26-16(28)10-12-4-2-1-3-5-12/h1-5,8-9,13,26H,6-7,10-11H2
46 atoms
F  1.29331 0.513061 2.136827
F  1.166898 -0.698357 -2.721777
F  3.202789 -1.219058 -3.16792
F  1.929272 -2.633274 -2.168896
F  3.919625 0.683217 2.693918
O  -1.557532 -1.726768 -0.135565
O  1.122559 2.097604 -0.916144
N  -0.201961 -1.691703 0.055468
N  -0.498488 0.566444 -0.467617
C  -2.615213 -2.755656 1.809749
C  -1.931103 -1.894019 2.822608
C  -3.269395 -1.493428 2.276693
C  -2.118479 -2.911474 0.395165
C  0.274562 -0.531974 -0.160094
C  1.740145 -0.394734 0.026625
C  2.680595 -0.791729 -0.920725
C  2.183091 0.107445 1.233142
C  -0.043568 1.81446 -0.808219
C  -1.146664 2.829648 -1.080445
C  4.033573 -0.693091 -0.63595
C  2.240261 -1.33768 -2.247815
C  -2.464302 2.55089 -0.415507
C  3.533311 0.204353 1.516051
C  4.463955 -0.198545 0.584118
C  -2.602501 2.725906 0.960239
C  -3.553245 2.078697 -1.140437
C  -3.79904 2.436939 1.593855
C  -4.754566 1.787824 -0.50808
C  -4.879789 1.966039 0.860024
H  -3.043507 -3.679047 2.188528
H  -1.063531 -1.319471 2.52808
H  -1.882055 -2.25816 3.840608
H  -3.307743 -0.648773 1.599657
H  -4.134453 -1.574317 2.922112
H  -2.956504 -3.160752 -0.2606
H  -1.385676 -3.719627 0.329399
H  -1.496804 0.418439 -0.421448
H  -1.269165 2.878847 -2.166189
H  -0.752771 3.800821 -0.778488
H  4.771675 -0.993811 -1.364742
H  5.518138 -0.119237 0.810679
H  -1.761678 3.087589 1.540233
H  -3.463013 1.937422 -2.210972
H  -3.888758 2.575789 2.662883
H  -5.591963 1.422423 -1.087358
H  -5.814274 1.738269 1.354973
totalener: -1531.64499014 hartree
nucrepener: 2972.29484232 hartree
electener: -4503.93983246 hartree
oneelecener: -8013.76312360 hartree
twoeener: 3509.82329114 hartree
kineticenergy: 1525.83832906 hartree
xcener: -138.195748864589 hartree
chargesum: -0.0000000
charge: -0.194888 -0.169571 -0.172705 -0.158885 -0.183362 -0.242409 -0.366926 -0.138008 -0.168713 -0.067351 -0.150926 -0.133206 0.064266 0.227106 -0.054794 -0.096725 0.260383 0.309370 -0.104174 -0.080072 0.525181 -0.027025 0.172262 -0.158983 -0.152699 -0.164831 -0.118165 -0.090169 -0.138964 0.062016 0.081013 0.075892 0.042008 0.074614 0.082659 0.085522 0.172786 0.098524 0.116744 0.128341 0.128512 0.121493 0.116418 0.129568 0.129943 0.128932
qa: -0.1949 -0.1696 -0.1727 -0.1589 -0.1834 -0.2424 -0.3669 -0.1380 -0.1687 -0.0674 -0.1509 -0.1332 0.0643 0.2271 -0.0548 -0.0967 0.2604 0.3094 -0.1042 -0.0801 0.5252 -0.0270 0.1723 -0.1590 -0.1527 -0.1648 -0.1182 -0.0902 -0.1390 0.0620 0.0810 0.0759 0.0420 0.0746 0.0827 0.0855 0.1728 0.0985 0.1167 0.1283 0.1285 0.1215 0.1164 0.1296 0.1299 0.1289
va: 1.1085 1.1336 1.1303 1.1420 1.1189 1.9597 2.1383 2.8767 3.2495 3.8422 3.9177 3.8853 3.9164 3.9006 3.8575 3.8126 3.8551 4.1481 3.8132 3.9288 4.4654 3.6674 4.0981 3.9311 3.9921 3.9748 3.9039 3.9239 3.9327 1.0164 1.0345 1.0228 1.0364 1.0214 0.9943 1.0175 1.0381 1.0108 1.0174 1.0150 1.0056 1.0094 1.0115 1.0010 0.9992 1.0005
dispcorr: -0.025896214 hartree
energy: -1531.670886356564
dipole: -40.95714 39.81745 -1.13970 3.66552 -3.58181 0.08371 13.70441 -13.39390 0.31051
magnitude: 1.18420 au
magnitude: 3.01000 debye
