program: Orca
programVersion: 5.0.2
elementType: F F F F F O O N N C C C C C C C C C C C C C C C C C C C C H H H H H H H H H H H H H H H H H
charge: 0
multiplicity: 1
keywords: wb97x-d3
keywords: def2-TZVPP
keywords: def2/J RIJCOSX
keywords: DEFGRID2
keywords: scfconv7
keywords: smallprint printgap noloewdin
keywords: NOSOSCF
formula: C20H17F5N2O2
InChI: InChI=1/C20H17F5N2O2/c21-15-9-8-14(20(23,24)25)17(18(15)22)19(27-29-11-13-6-7-13)26-16(28)10-12-4-2-1-3-5-12/h1-5,8-9,13,26H,6-7,10-11H2
46 atoms
F  1.413131 1.757123 1.300799
F  3.071276 -2.574184 -2.370789
F  1.83215 -3.184279 -0.731041
F  1.064889 -1.82237 -2.213994
F  4.032496 2.287052 1.364406
O  -1.406044 -1.547114 0.802698
O  0.767334 1.616693 -1.903677
N  -0.049173 -1.419966 0.746098
N  -0.597413 0.491131 -0.476802
C  -3.249932 -2.766028 1.604716
C  -4.010462 -3.268561 0.417851
C  -3.91345 -4.107747 1.652029
C  -1.757763 -2.703639 1.543653
C  0.300217 -0.402383 0.067642
C  1.756681 -0.146254 -0.020199
C  2.650867 -0.972196 -0.700954
C  2.253368 0.946763 0.662036
C  -0.314731 1.470167 -1.394435
C  -1.511392 2.343808 -1.743772
C  4.010597 -0.69971 -0.657439
C  2.149458 -2.142772 -1.501915
C  -2.43797 2.617971 -0.591883
C  3.606728 1.221635 0.693667
C  4.494119 0.393624 0.042865
C  -3.70461 2.047539 -0.530241
C  -2.017159 3.429193 0.460534
C  -4.535462 2.279907 0.558292
C  -2.844638 3.665696 1.544581
C  -4.107797 3.090338 1.596849
H  -3.71658 -1.975459 2.183034
H  -3.444265 -3.573618 -0.453269
H  -4.958841 -2.803348 0.184534
H  -3.287642 -4.991001 1.621719
H  -4.792875 -4.218462 2.271833
H  -1.353338 -3.596762 1.053805
H  -1.324096 -2.650507 2.547245
H  -1.545051 0.414603 -0.134832
H  -2.050938 1.850872 -2.55806
H  -1.112027 3.270342 -2.156889
H  4.712838 -1.331371 -1.180683
H  5.55282 0.610585 0.075423
H  -4.0478 1.415296 -1.34106
H  -1.029974 3.875376 0.43113
H  -5.518284 1.828219 0.589729
H  -2.503777 4.298886 2.353108
H  -4.754107 3.274562 2.444672
totalener: -1531.64710479 hartree
nucrepener: 2914.47775941 hartree
electener: -4446.12486420 hartree
oneelecener: -7898.23383937 hartree
twoeener: 3452.10897517 hartree
kineticenergy: 1525.84445065 hartree
xcener: -138.194059256550 hartree
chargesum: -0.0000000
charge: -0.192633 -0.174577 -0.157926 -0.168673 -0.183833 -0.225640 -0.358450 -0.140922 -0.183981 -0.065186 -0.131072 -0.162835 0.053247 0.265392 -0.062100 -0.119990 0.249977 0.296749 -0.111963 -0.065307 0.527090 -0.005979 0.183442 -0.164338 -0.177878 -0.165533 -0.107886 -0.104207 -0.128295 0.073893 0.070839 0.073764 0.070135 0.078660 0.063428 0.076414 0.176304 0.099902 0.115787 0.130590 0.128595 0.118108 0.120013 0.127375 0.130695 0.128804
qa: -0.1926 -0.1746 -0.1579 -0.1687 -0.1838 -0.2256 -0.3584 -0.1409 -0.1840 -0.0652 -0.1311 -0.1628 0.0532 0.2654 -0.0621 -0.1200 0.2500 0.2967 -0.1120 -0.0653 0.5271 -0.0060 0.1834 -0.1643 -0.1779 -0.1655 -0.1079 -0.1042 -0.1283 0.0739 0.0708 0.0738 0.0701 0.0787 0.0634 0.0764 0.1763 0.0999 0.1158 0.1306 0.1286 0.1181 0.1200 0.1274 0.1307 0.1288
va: 1.1127 1.1271 1.1417 1.1357 1.1184 1.9712 2.1445 2.9164 3.2530 3.8626 3.8920 3.9411 3.9478 3.8942 3.8574 3.8484 3.8607 4.1649 3.8004 3.8932 4.4610 3.6659 4.0788 3.9370 3.9639 4.0097 3.9468 3.9394 3.9651 1.0136 1.0244 1.0215 1.0220 1.0211 1.0019 1.0074 1.0328 1.0071 1.0192 1.0141 1.0060 1.0103 1.0132 1.0001 0.9992 0.9992
dispcorr: -0.022993238 hartree
energy: -1531.670098030151
dipole: -43.69150 42.53838 -1.15312 -0.54867 0.67700 0.12833 10.20488 -9.64338 0.56150
magnitude: 1.28897 au
magnitude: 3.27629 debye
