program: Orca
programVersion: 5.0.2
elementType: F F F F F O O N N C C C C C C C C C C C C C C C C C C C C H H H H H H H H H H H H H H H H H
charge: 0
multiplicity: 1
keywords: wb97x-d3
keywords: def2-TZVPP
keywords: def2/J RIJCOSX
keywords: DEFGRID2
keywords: scfconv7
keywords: smallprint printgap noloewdin
keywords: NOSOSCF
formula: C20H17F5N2O2
InChI: InChI=1/C20H17F5N2O2/c21-15-9-8-14(20(23,24)25)17(18(15)22)19(27-29-11-13-6-7-13)26-16(28)10-12-4-2-1-3-5-12/h1-5,8-9,13,26H,6-7,10-11H2
46 atoms
F  2.531413 0.871281 2.315328
F  2.084237 -1.089089 -3.245657
F  1.207697 -2.32155 -1.724428
F  0.43235 -0.349056 -2.084037
F  5.145292 1.07417 1.710802
O  -0.995319 -1.437036 1.43945
O  1.131168 2.457695 -0.217179
N  0.312767 -1.402307 1.043017
N  -0.211972 0.836328 0.648369
C  -2.836665 -2.744626 2.080578
C  -3.989166 -2.258653 1.257753
C  -3.869809 -3.712044 1.588884
C  -1.467791 -2.772086 1.478863
C  0.653539 -0.236083 0.666774
C  2.064353 -0.083596 0.235114
C  2.522088 -0.499676 -1.013733
C  2.964959 0.450537 1.132558
C  0.043371 2.08674 0.143915
C  -1.17793 2.995709 0.118324
C  3.867212 -0.383624 -1.330039
C  1.560097 -1.06911 -2.016779
C  -2.469466 2.293256 -0.196554
C  4.306215 0.562515 0.816325
C  4.762934 0.143418 -0.413906
C  -2.672112 1.748217 -1.463216
C  -3.461584 2.137015 0.764864
C  -3.838981 1.064775 -1.759209
C  -4.632502 1.450686 0.471034
C  -4.823525 0.913406 -0.791326
H  -2.86347 -2.507587 3.138851
H  -3.789515 -1.940415 0.242165
H  -4.755922 -1.677524 1.752212
H  -3.594577 -4.396447 0.795942
H  -4.552635 -4.136092 2.312737
H  -1.498979 -3.189468 0.465307
H  -0.785651 -3.390404 2.070257
H  -1.167094 0.606726 0.88758
H  -0.96863 3.780287 -0.609216
H  -1.240451 3.488374 1.093348
H  4.235277 -0.697825 -2.295349
H  5.813028 0.236473 -0.65405
H  -1.905988 1.856976 -2.222022
H  -3.319523 2.555473 1.754373
H  -3.981643 0.64815 -2.747489
H  -5.395361 1.339285 1.230283
H  -5.734634 0.377544 -1.02235
totalener: -1531.64703998 hartree
nucrepener: 2954.51043135 hartree
electener: -4486.15747133 hartree
oneelecener: -7978.19612240 hartree
twoeener: 3492.03865107 hartree
kineticenergy: 1525.85264743 hartree
xcener: -138.195955953224 hartree
chargesum: -0.0000000
charge: -0.185909 -0.172624 -0.157705 -0.174465 -0.182658 -0.235303 -0.364420 -0.141182 -0.183857 -0.054273 -0.137541 -0.161673 0.054957 0.260256 -0.096880 -0.105909 0.285087 0.312337 -0.111108 -0.084849 0.533826 -0.008111 0.164442 -0.153490 -0.174352 -0.157257 -0.083256 -0.105845 -0.162625 0.073187 0.072737 0.071328 0.069713 0.079188 0.061202 0.080542 0.175064 0.116672 0.097439 0.131193 0.128626 0.120776 0.115848 0.131780 0.128030 0.131062
qa: -0.1859 -0.1726 -0.1577 -0.1745 -0.1827 -0.2353 -0.3644 -0.1412 -0.1839 -0.0543 -0.1375 -0.1617 0.0550 0.2603 -0.0969 -0.1059 0.2851 0.3123 -0.1111 -0.0848 0.5338 -0.0081 0.1644 -0.1535 -0.1744 -0.1573 -0.0833 -0.1058 -0.1626 0.0732 0.0727 0.0713 0.0697 0.0792 0.0612 0.0805 0.1751 0.1167 0.0974 0.1312 0.1286 0.1208 0.1158 0.1318 0.1280 0.1311
va: 1.1249 1.1305 1.1442 1.1239 1.1198 1.9582 2.1373 2.9169 3.2474 3.8678 3.8718 3.9528 3.9361 3.9082 3.8681 3.8163 3.8820 4.1391 3.8038 3.9220 4.4477 3.6721 4.0853 3.9235 4.0145 3.9571 3.8989 3.8936 3.9289 1.0148 1.0242 1.0235 1.0215 1.0212 1.0022 1.0101 1.0406 1.0190 1.0077 1.0138 1.0059 1.0138 1.0103 0.9980 1.0001 0.9996
dispcorr: -0.024967642 hartree
energy: -1531.672007624369
dipole: -44.81665 43.58166 -1.23499 -4.69471 4.51903 -0.17568 8.27843 -8.29183 -0.01341
magnitude: 1.24749 au
magnitude: 3.17088 debye
