program: Orca
programVersion: 5.0.2
elementType: F F F F F O O N N C C C C C C C C C C C C C C C C C C C C H H H H H H H H H H H H H H H H H
charge: 0
multiplicity: 1
keywords: wb97x-d3
keywords: def2-TZVPP
keywords: def2/J RIJCOSX
keywords: DEFGRID2
keywords: scfconv7
keywords: smallprint printgap noloewdin
keywords: NOSOSCF
formula: C20H17F5N2O2
InChI: InChI=1/C20H17F5N2O2/c21-15-9-8-14(20(23,24)25)17(18(15)22)19(27-29-11-13-6-7-13)26-16(28)10-12-4-2-1-3-5-12/h1-5,8-9,13,26H,6-7,10-11H2
46 atoms
F  1.584727 1.679414 1.434202
F  0.950455 -1.814482 -2.15347
F  2.93107 -2.608661 -2.418079
F  1.761653 -3.202341 -0.721711
F  4.2239 2.144947 1.354968
O  -1.400948 -1.453504 0.905332
O  0.86742 1.653484 -1.797387
N  -0.040844 -1.382192 0.826962
N  -0.530044 0.557892 -0.377663
C  -3.282978 -2.638292 1.665754
C  -4.072491 -3.037053 0.458327
C  -4.000681 -3.952883 1.638695
C  -1.789903 -2.631483 1.591661
C  0.339383 -0.374233 0.151385
C  1.802894 -0.17905 0.026993
C  2.635433 -1.013244 -0.718527
C  2.367029 0.873835 0.719893
C  -0.220798 1.528854 -1.294876
C  -1.391792 2.428694 -1.66757
C  4.002074 -0.776692 -0.746049
C  2.06394 -2.162707 -1.501587
C  -2.423318 2.622495 -0.591894
C  3.727179 1.113189 0.680585
C  4.55218 0.286255 -0.048805
C  -3.665496 2.000543 -0.663126
C  -2.133339 3.411341 0.520009
C  -4.599894 2.161755 0.351518
C  -3.063836 3.576195 1.531911
C  -4.301148 2.950456 1.450623
H  -3.712897 -1.865027 2.293832
H  -3.526213 -3.311541 -0.435503
H  -5.002468 -2.51983 0.26345
H  -3.410946 -4.85674 1.548891
H  -4.879037 -4.065846 2.259732
H  -1.425693 -3.513772 1.052816
H  -1.344249 -2.646421 2.591329
H  -1.482204 0.500536 -0.044188
H  -1.851855 1.99987 -2.563027
H  -0.962727 3.382726 -1.975936
H  4.65723 -1.411764 -1.323366
H  5.615795 0.47866 -0.075168
H  -3.907827 1.384727 -1.521494
H  -1.167468 3.897407 0.594186
H  -5.56213 1.671994 0.278655
H  -2.823523 4.193651 2.387372
H  -5.028377 3.080237 2.241114
totalener: -1531.64765928 hartree
nucrepener: 2914.43624360 hartree
electener: -4446.08390288 hartree
oneelecener: -7898.15098141 hartree
twoeener: 3452.06707853 hartree
kineticenergy: 1525.83604967 hartree
xcener: -138.192853729811 hartree
chargesum: -0.0000000
charge: -0.192071 -0.169672 -0.174488 -0.158378 -0.183807 -0.225127 -0.363822 -0.140115 -0.185564 -0.063359 -0.130580 -0.163354 0.051843 0.261276 -0.070768 -0.113522 0.255542 0.300802 -0.106813 -0.068984 0.529479 -0.012570 0.181415 -0.161810 -0.171028 -0.166283 -0.109206 -0.104120 -0.126902 0.074246 0.070500 0.072615 0.069935 0.078600 0.063445 0.076917 0.178562 0.098725 0.116528 0.130579 0.128446 0.116776 0.120374 0.126895 0.130360 0.128482
qa: -0.1921 -0.1697 -0.1745 -0.1584 -0.1838 -0.2251 -0.3638 -0.1401 -0.1856 -0.0634 -0.1306 -0.1634 0.0518 0.2613 -0.0708 -0.1135 0.2555 0.3008 -0.1068 -0.0690 0.5295 -0.0126 0.1814 -0.1618 -0.1710 -0.1663 -0.1092 -0.1041 -0.1269 0.0742 0.0705 0.0726 0.0699 0.0786 0.0634 0.0769 0.1786 0.0987 0.1165 0.1306 0.1284 0.1168 0.1204 0.1269 0.1304 0.1285
va: 1.1141 1.1345 1.1273 1.1415 1.1183 1.9707 2.1405 2.9165 3.2559 3.8616 3.8922 3.9440 3.9483 3.9007 3.8572 3.8438 3.8630 4.1634 3.8041 3.9009 4.4584 3.6614 4.0775 3.9342 3.9681 4.0161 3.9465 3.9399 3.9637 1.0136 1.0245 1.0217 1.0220 1.0211 1.0022 1.0073 1.0322 1.0085 1.0185 1.0144 1.0060 1.0110 1.0111 1.0005 0.9994 0.9994
dispcorr: -0.023024158 hartree
energy: -1531.670683441551
dipole: -44.31317 43.12626 -1.18691 0.41352 -0.26168 0.15184 9.55769 -9.08893 0.46876
magnitude: 1.28513 au
magnitude: 3.26654 debye
