program: Orca
programVersion: 5.0.2
elementType: F F F F F O O N N C C C C C C C C C C C C C C C C C C C C H H H H H H H H H H H H H H H H H
charge: 0
multiplicity: 1
keywords: wb97x-d3
keywords: def2-TZVPP
keywords: def2/J RIJCOSX
keywords: DEFGRID2
keywords: scfconv7
keywords: smallprint printgap noloewdin
keywords: NOSOSCF
formula: C20H17F5N2O2
InChI: InChI=1/C20H17F5N2O2/c21-15-9-8-14(20(23,24)25)17(18(15)22)19(27-29-11-13-6-7-13)26-16(28)10-12-4-2-1-3-5-12/h1-5,8-9,13,26H,6-7,10-11H2
46 atoms
F  1.540538 1.663556 1.421637
F  3.072084 -2.519908 -2.478956
F  1.855698 -3.184504 -0.845144
F  1.07244 -1.766098 -2.26571
F  4.171234 2.146892 1.452657
O  -1.381286 -1.580731 0.608012
O  0.894543 1.800987 -1.725614
N  -0.023636 -1.458356 0.619452
N  -0.513072 0.564996 -0.435977
C  -3.205295 -3.029883 0.924341
C  -4.104162 -3.66157 1.942457
C  -4.28946 -2.224978 1.570239
C  -1.777446 -2.76513 1.27901
C  0.359415 -0.388482 0.048161
C  1.822309 -0.167458 -0.013799
C  2.690514 -0.980425 -0.744186
C  2.352128 0.875837 0.72051
C  -0.203044 1.611798 -1.26507
C  -1.387399 2.511048 -1.599293
C  4.055754 -0.734778 -0.710475
C  2.165396 -2.116092 -1.581166
C  -2.452214 2.585517 -0.541374
C  3.710774 1.124545 0.739733
C  4.570479 0.316144 0.030253
C  -3.660016 1.910717 -0.685501
C  -2.22352 3.303597 0.630792
C  -4.618853 1.94782 0.318104
C  -3.179598 3.345874 1.631429
C  -4.380364 2.665663 1.478505
H  -3.368015 -3.320994 -0.107955
H  -3.693306 -3.887826 2.918606
H  -4.832089 -4.383798 1.598457
H  -4.000722 -1.466859 2.287383
H  -5.148016 -1.955538 0.969745
H  -1.135768 -3.594333 0.968555
H  -1.66219 -2.642768 2.362871
H  -1.472537 0.462575 -0.135884
H  -1.810381 2.146468 -2.540257
H  -0.976078 3.497863 -1.814635
H  4.738676 -1.353368 -1.273149
H  5.633115 0.514348 0.051537
H  -3.855107 1.349623 -1.591934
H  -1.285171 3.829669 0.761657
H  -5.552726 1.416894 0.189237
H  -2.98726 3.909053 2.535054
H  -5.126436 2.698108 2.261353
totalener: -1531.64720931 hartree
nucrepener: 2917.46793859 hartree
electener: -4449.11514791 hartree
oneelecener: -7904.21783413 hartree
twoeener: 3455.10268622 hartree
kineticenergy: 1525.83968712 hartree
xcener: -138.193923460223 hartree
chargesum: 0.0000000
charge: -0.192446 -0.174783 -0.157701 -0.169848 -0.183694 -0.224128 -0.363809 -0.141467 -0.184911 -0.061563 -0.162144 -0.132244 0.053360 0.260938 -0.066592 -0.127851 0.259393 0.297883 -0.105964 -0.067737 0.533363 -0.008109 0.185212 -0.163644 -0.169335 -0.166730 -0.117269 -0.102696 -0.126669 0.074504 0.069235 0.079342 0.068332 0.071788 0.084126 0.058191 0.178045 0.099031 0.115676 0.130430 0.128431 0.117744 0.120598 0.126148 0.130694 0.128870
qa: -0.1924 -0.1748 -0.1577 -0.1698 -0.1837 -0.2241 -0.3638 -0.1415 -0.1849 -0.0616 -0.1621 -0.1322 0.0534 0.2609 -0.0666 -0.1279 0.2594 0.2979 -0.1060 -0.0677 0.5334 -0.0081 0.1852 -0.1636 -0.1693 -0.1667 -0.1173 -0.1027 -0.1267 0.0745 0.0692 0.0793 0.0683 0.0718 0.0841 0.0582 0.1780 0.0990 0.1157 0.1304 0.1284 0.1177 0.1206 0.1261 0.1307 0.1289
va: 1.1140 1.1262 1.1413 1.1346 1.1186 1.9744 2.1409 2.9127 3.2509 3.8715 3.9457 3.8842 3.9427 3.9063 3.8380 3.8614 3.8505 4.1682 3.8063 3.8974 4.4523 3.6593 4.0742 3.9372 3.9591 4.0178 3.9377 3.9382 3.9548 1.0141 1.0220 1.0212 1.0245 1.0224 1.0091 0.9997 1.0328 1.0083 1.0191 1.0145 1.0061 1.0107 1.0112 1.0011 0.9991 0.9994
dispcorr: -0.023389857 hartree
energy: -1531.670599171807
dipole: -45.27935 44.07329 -1.20607 0.99267 -0.92300 0.06967 11.55760 -11.07508 0.48251
magnitude: 1.30087 au
magnitude: 3.30656 debye
