program: Gaussian 09
title: 000064033
version: EM64L-G09RevD.01
frameworkgroup: C1[X(C13H16N4O2)]
method: RPBEPBE
basis: SDD
operation: Freq
keyword: #p
keyword: freq=noraman
keyword: PBEPBE/SDD
title: #p freq=noraman PBEPBE/SDD
converged: YES YES NO NO
title: Mulliken charges:
elementType: O O N N N N C C C C C C C C C C C C C H H H H H H H H H H H H H H H H
charge: -0.447152 -0.274837 -0.054920 -0.031427 -0.124740 -0.037957 -0.340647 -0.348456 -0.420857 -0.429535 -0.377731 0.213306 -0.263643 0.128445 0.061418 -0.326957 -0.331525 -0.240080 -0.205454 0.221783 0.203273 0.251406 0.215930 0.221019 0.226419 0.226134 0.226608 0.254393 0.207680 0.239946 0.360998 0.269879 0.259865 0.233674 0.233742
chargesum: 0.00000
title: Mulliken charges with hydrogens summed into heavy atoms:
elementType: O O N N N N C C C C C C C C C C C C C
charge: -0.086154 -0.274837 -0.054920 -0.031427 -0.124740 -0.037957 0.084409 0.118880 0.026581 0.023206 0.084342 0.213306 -0.023698 0.128445 0.061418 -0.057078 -0.071659 -0.006405 0.028288
polarizability: 2.43488448e+02 7.22423230e+00 1.70545125e+02 3.29946223e+01 -2.96959954e+00 1.16267478e+02
1716.lowfreq: -13.7572 0.0008 0.0009 0.0010 4.3271 7.8535 23.6886 36.2016 40.1012
frequency: 23.6721 36.0324 39.8911 68.9825 111.4129 137.2466 184.7198 191.8736 230.2181 233.5996 282.1284 285.7527 294.1251 308.8873 389.2919 407.8635 418.1765 425.3676 459.5403 477.6542 490.1353 498.6134 525.9662 545.1569 585.9695 595.2484 647.6074 678.8146 696.0473 708.1569 751.6980 766.7644 784.7823 798.6581 812.3535 839.0974 849.7739 891.4920 893.1228 907.1373 932.9385 980.3364 988.2901 1003.1957 1003.6570 1016.0161 1018.5658 1022.6673 1075.9376 1092.6892 1119.5073 1125.8790 1143.0532 1163.8429 1169.8005 1199.5659 1211.0507 1228.6788 1236.2026 1241.8991 1280.3309 1288.2184 1302.4646 1326.1446 1337.3394 1339.0032 1346.7669 1358.5872 1372.1063 1379.2877 1389.0641 1409.0942 1431.5235 1444.0294 1447.6852 1451.9662 1456.7755 1461.7068 1472.7322 1547.6220 1561.1098 1603.5047 1619.0975 2908.1935 2918.7576 2964.8928 3006.3603 3013.2378 3029.3031 3065.3912 3071.1508 3083.7963 3088.1368 3128.2052 3134.8435 3149.0384 3164.0527 3174.2773 3553.4541
redmass: 5.3922 4.3808 4.6295 5.7984 6.1833 5.0006 4.0166 3.9897 3.9731 3.5701 1.2119 2.6224 5.8482 5.3436 1.9201 2.5116 2.1228 3.0340 3.9544 3.5058 7.0940 3.2251 5.5318 5.9398 6.8846 3.4711 2.1698 4.9105 4.8638 6.3026 4.8911 4.4718 1.4621 4.0301 1.6320 5.1651 3.7080 1.8725 1.8677 1.4918 6.5087 1.3749 2.2029 1.3343 2.6824 2.4339 1.7565 2.1353 2.8607 2.3585 3.0173 2.6553 2.2755 1.4404 1.5043 1.5944 1.5407 2.5790 1.1814 1.4624 1.7495 1.2825 1.9850 1.6500 1.3747 1.4516 1.2511 1.2881 1.8780 1.4377 2.0586 1.7341 1.0886 1.0937 1.7955 1.4029 2.7140 1.0822 1.1030 6.5235 7.1129 10.1897 6.8763 1.0679 1.0687 1.0668 1.0629 1.0632 1.0879 1.0930 1.0959 1.1022 1.1040 1.0917 1.0861 1.0901 1.0957 1.0997 1.0681
irintensity: 0.0905 0.1275 0.4618 2.9806 1.3064 1.5128 2.4819 2.2583 0.4631 1.4643 107.6234 7.0803 10.4647 2.4542 12.6525 6.6552 1.5816 6.3785 5.6514 1.0940 0.9602 3.2513 3.8128 9.0838 3.6991 1.7083 15.3071 18.7476 14.5110 30.4865 30.5173 31.7235 78.4491 4.2609 0.7762 23.9731 20.6158 6.8774 2.9423 11.5324 5.0802 3.3258 34.0476 0.1929 85.3683 33.9173 18.0788 14.6108 78.1845 7.7156 11.1756 81.5939 10.5168 68.1118 19.2009 2.5094 2.2401 19.2824 72.1147 3.7909 12.0452 7.5133 72.3183 12.7355 2.6665 24.4223 0.4825 42.1431 16.5567 4.6934 10.1529 17.4028 7.1231 12.9949 6.3932 18.5090 49.3198 12.4653 10.7467 113.3762 24.5206 401.3279 13.3502 68.4096 87.1269 65.5797 12.5799 31.4952 43.9362 4.9849 8.1008 31.0628 36.7458 13.8299 4.4468 6.9204 12.5632 21.7612 16.2952
temp: 298.150 k
press: 1.00000 atm
elementType: 8 8 7 7 7 7 6 6 6 6 6 6 6 6 6 6 6 6 6 1 1 1 1 1 1 1 1 1 1 1 1 1 1 1 1
symmnumber: 1
zpe: 737653.6 jmol-1
zpe.correction: 0.280957 hartree
zpe.thermalcorrener: 0.297261 hartree
zpe.thermalcorrenthalpy: 0.298205 hartree
zpe.thermalcorrgfe: 0.235880 hartree
zpe.sumelectzpe: -872.985405 hartree
zpe.sumelectthermal: -872.969102 hartree
zpe.sumelectthermalent: -872.968157 hartree
zpe.sumelectthermalfe: -873.030483 hartree
dipole: 0.7755 0.9118 -0.2980
dipole: 1.2336
quadrupole: -97.1399 -111.0481 -111.7392
quadrupole: 6.2467 3.4957 3.2520
quadrupole: 9.5025 -4.4057 -5.0968 6.2467 3.4957 3.2520
hfenergy: -873.2663628 hartree
pointgroup: C01 [X(C13H16N4O2)]
dipole: 0.3004751 -0.3784824 -0.0447143 debye
polarizability: 243.9524153|6.3351866|162.8760486|-32.1670887|19.4051086|123.4725873 unknown
InChI: InChI=1S/C13H16N4O2/c18-13-11-3-1-2-4-12(11)14-9-16(13)10-15-5-7-17(19)8-6-15/h1-4,9,19H,5-8,10H2
charge 0 multiplicity 1
35 atoms
O  5.474551 -0.113199 0.361054
O  -0.340303 1.983971 -0.334061
N  2.132258 -0.025985 -0.589424
N  4.314734 -0.140872 1.352847
N  -0.258735 -0.211295 -1.159142
N  -2.063559 -1.795026 -0.885685
C  2.889067 -1.284087 -0.426377
C  2.918715 1.197698 -0.312567
C  3.505025 -1.344651 0.990581
C  3.529754 1.110098 1.10189
C  1.150041 0.03505 -1.645894
C  -0.909976 0.85779 -0.468968
C  -0.865681 -1.453946 -1.32644
C  -2.254487 0.51319 0.031709
C  -2.784865 -0.802551 -0.187506
C  -3.021401 1.481556 0.731438
C  -4.079958 -1.121326 0.307147
C  -4.298969 1.152126 1.212245
C  -4.826606 -0.153779 0.998763
H  3.705057 -1.376955 -1.181107
H  2.204449 -2.144245 -0.55115
H  2.235574 2.0631 -0.359426
H  3.740495 1.337036 -1.051966
H  2.695118 -1.398009 1.742716
H  4.149584 -2.232998 1.097521
H  4.193314 1.96947 1.294194
H  2.718808 1.111588 1.854631
H  1.140754 1.039588 -2.101439
H  1.324872 -0.721747 -2.438733
H  -0.277594 -2.19478 -1.880839
H  6.253622 -0.131898 0.97567
H  -2.587803 2.475903 0.88064
H  -4.464239 -2.13001 0.128487
H  -4.891811 1.89776 1.752451
H  -5.823907 -0.404466 1.37674
