program: Orca
programVersion: 5.0.2
elementType: F F F F F O O N N C C C C C C C C C C C C C C C C C C C C H H H H H H H H H H H H H H H H H
charge: 0
multiplicity: 1
keywords: wb97x-d3
keywords: def2-TZVPP
keywords: def2/J RIJCOSX
keywords: DEFGRID2
keywords: scfconv7
keywords: smallprint printgap noloewdin
keywords: NOSOSCF
formula: C20H17F5N2O2
InChI: InChI=1/C20H17F5N2O2/c21-15-9-8-14(20(23,24)25)17(18(15)22)19(27-29-11-13-6-7-13)26-16(28)10-12-4-2-1-3-5-12/h1-5,8-9,13,26H,6-7,10-11H2
46 atoms
F  2.339081 1.171078 2.095568
F  0.6121 -0.785759 -2.222069
F  2.335699 -1.784616 -3.031818
F  1.246956 -2.677571 -1.415909
F  5.000298 1.179708 1.723766
O  -1.179789 -1.215662 1.303904
O  1.184664 2.323634 -0.764273
N  0.155102 -1.267886 1.018048
N  -0.257972 0.902017 0.270669
C  -3.094913 -2.358127 2.039868
C  -4.143661 -2.150156 0.992352
C  -4.064285 -3.454975 1.719213
C  -1.666706 -2.50722 1.624702
C  0.565855 -0.179597 0.502704
C  2.014209 -0.132616 0.180066
C  2.569357 -0.790116 -0.917242
C  2.85426 0.531222 1.051092
C  0.073775 2.062813 -0.37725
C  -1.081289 3.045337 -0.535191
C  3.942707 -0.776884 -1.110222
C  1.687119 -1.513288 -1.895059
C  -2.462028 2.453278 -0.50886
C  4.22321 0.540298 0.856485
C  4.773542 -0.114663 -0.222311
C  -3.282274 2.586418 0.606831
C  -2.934985 1.73029 -1.602466
C  -4.547631 2.016011 0.630895
C  -4.197096 1.160629 -1.582009
C  -5.007979 1.302879 -0.464049
H  -3.243207 -1.843354 2.98327
H  -3.825892 -2.115275 -0.042471
H  -4.961264 -1.479118 1.219378
H  -3.699055 -4.320749 1.180308
H  -4.827065 -3.688308 2.450205
H  -1.58535 -3.165959 0.752318
H  -1.063003 -2.94324 2.426164
H  -1.227103 0.756007 0.518695
H  -0.904022 3.580024 -1.469388
H  -0.971324 3.788149 0.260546
H  4.383703 -1.278482 -1.958375
H  5.844969 -0.100539 -0.366236
H  -2.93104 3.145977 1.465772
H  -2.30701 1.613333 -2.477885
H  -5.173666 2.133141 1.505638
H  -4.550701 0.605361 -2.440711
H  -5.995248 0.860175 -0.449587
totalener: -1531.64773346 hartree
nucrepener: 2937.19650452 hartree
electener: -4468.84423798 hartree
oneelecener: -7943.60643836 hartree
twoeener: 3474.76220038 hartree
kineticenergy: 1525.83710877 hartree
xcener: -138.193304904798 hartree
chargesum: -0.0000000
charge: -0.187481 -0.173867 -0.173302 -0.157989 -0.182955 -0.229282 -0.370491 -0.141345 -0.187181 -0.054462 -0.128116 -0.162167 0.049975 0.263990 -0.092316 -0.108156 0.275386 0.312958 -0.101650 -0.079198 0.531702 -0.023021 0.169377 -0.156886 -0.153126 -0.164635 -0.096404 -0.105028 -0.156862 0.072522 0.066955 0.068801 0.070762 0.078579 0.061835 0.080284 0.179453 0.116547 0.097173 0.131353 0.128696 0.115912 0.121442 0.128402 0.131589 0.132228
qa: -0.1875 -0.1739 -0.1733 -0.1580 -0.1830 -0.2293 -0.3705 -0.1413 -0.1872 -0.0545 -0.1281 -0.1622 0.0500 0.2640 -0.0923 -0.1082 0.2754 0.3130 -0.1017 -0.0792 0.5317 -0.0230 0.1694 -0.1569 -0.1531 -0.1646 -0.0964 -0.1050 -0.1569 0.0725 0.0670 0.0688 0.0708 0.0786 0.0618 0.0803 0.1795 0.1165 0.0972 0.1314 0.1287 0.1159 0.1214 0.1284 0.1316 0.1322
va: 1.1224 1.1270 1.1290 1.1436 1.1191 1.9659 2.1355 2.9189 3.2503 3.8679 3.8755 3.9548 3.9432 3.9012 3.8686 3.8258 3.8871 4.1486 3.8088 3.9107 4.4529 3.6637 4.0785 3.9275 3.9767 4.0129 3.9143 3.9058 3.9372 1.0146 1.0269 1.0248 1.0217 1.0211 1.0024 1.0088 1.0366 1.0180 1.0103 1.0142 1.0060 1.0109 1.0092 0.9998 0.9989 0.9981
dispcorr: -0.024393529 hartree
energy: -1531.672126990143
dipole: -45.84509 44.57162 -1.27347 -1.32821 1.22734 -0.10086 8.14506 -8.01568 0.12938
magnitude: 1.28399 au
magnitude: 3.26365 debye
