program: Orca
programVersion: 5.0.2
elementType: F F F F F O O N N C C C C C C C C C C C C C C C C C C C C H H H H H H H H H H H H H H H H H
charge: 0
multiplicity: 1
keywords: wb97x-d3
keywords: def2-TZVPP
keywords: def2/J RIJCOSX
keywords: DEFGRID2
keywords: scfconv7
keywords: smallprint printgap noloewdin
keywords: NOSOSCF
formula: C20H17F5N2O2
InChI: InChI=1/C20H17F5N2O2/c21-15-9-8-14(20(23,24)25)17(18(15)22)19(27-29-11-13-6-7-13)26-16(28)10-12-4-2-1-3-5-12/h1-5,8-9,13,26H,6-7,10-11H2
46 atoms
F  1.046454 1.217686 1.621856
F  3.350177 -2.123671 -2.682777
F  1.871621 -3.075865 -1.456945
F  1.328516 -1.391245 -2.683451
F  3.616368 1.682077 2.200529
O  -1.606951 -1.773164 -0.208023
O  0.934826 1.972638 -1.508349
N  -0.265839 -1.666567 0.032824
N  -0.623477 0.506101 -0.739727
C  -2.706207 -2.825207 1.702186
C  -2.087346 -1.95149 2.745363
C  -3.403635 -1.573446 2.133614
C  -2.13158 -2.976783 0.317801
C  0.18144 -0.521536 -0.297048
C  1.628032 -0.29554 -0.070437
C  2.634166 -0.949164 -0.781402
C  1.991972 0.5816 0.932273
C  -0.210577 1.716454 -1.23708
C  -1.34453 2.712024 -1.444887
C  3.965124 -0.716615 -0.467685
C  2.289517 -1.890566 -1.901863
C  -2.478892 2.576714 -0.467141
C  3.318663 0.821594 1.233073
C  4.312743 0.168155 0.539473
C  -2.261149 2.82189 0.888235
C  -3.741962 2.165124 -0.876487
C  -3.281649 2.65689 1.808644
C  -4.768375 1.999527 0.044959
C  -4.539531 2.243286 1.389041
H  -3.137879 -3.755073 2.060653
H  -1.21619 -1.364729 2.487099
H  -2.080354 -2.312513 3.76559
H  -3.421559 -0.72763 1.457291
H  -4.297786 -1.669023 2.735837
H  -2.921094 -3.279426 -0.374701
H  -1.356232 -3.746711 0.30252
H  -1.613765 0.365022 -0.598653
H  -1.706685 2.591626 -2.470308
H  -0.897134 3.705546 -1.395423
H  4.752373 -1.213731 -1.014369
H  5.34937 0.357929 0.780876
H  -1.280058 3.135122 1.225633
H  -3.927972 1.971709 -1.926438
H  -3.094719 2.844973 2.857496
H  -5.745462 1.678181 -0.290664
H  -5.335594 2.110918 2.109546
totalener: -1531.64409887 hartree
nucrepener: 2976.97743795 hartree
electener: -4508.62153682 hartree
oneelecener: -8023.14637834 hartree
twoeener: 3514.52484153 hartree
kineticenergy: 1525.84135855 hartree
xcener: -138.196172992215 hartree
chargesum: 0.0000000
charge: -0.197990 -0.174267 -0.156414 -0.167777 -0.183193 -0.237605 -0.356912 -0.150028 -0.170816 -0.066859 -0.147247 -0.137579 0.058066 0.251026 -0.030419 -0.144068 0.254738 0.289621 -0.105024 -0.062615 0.529130 -0.019545 0.185561 -0.163692 -0.166536 -0.165585 -0.084524 -0.086652 -0.160993 0.062167 0.077610 0.076065 0.047291 0.074052 0.083269 0.087168 0.170084 0.097865 0.116036 0.131119 0.128287 0.117540 0.114349 0.129815 0.128121 0.127359
qa: -0.1980 -0.1743 -0.1564 -0.1678 -0.1832 -0.2376 -0.3569 -0.1500 -0.1708 -0.0669 -0.1472 -0.1376 0.0581 0.2510 -0.0304 -0.1441 0.2547 0.2896 -0.1050 -0.0626 0.5291 -0.0195 0.1856 -0.1637 -0.1665 -0.1656 -0.0845 -0.0867 -0.1610 0.0622 0.0776 0.0761 0.0473 0.0741 0.0833 0.0872 0.1701 0.0979 0.1160 0.1311 0.1283 0.1175 0.1143 0.1298 0.1281 0.1274
va: 1.1036 1.1271 1.1442 1.1372 1.1196 1.9635 2.1463 2.8576 3.2410 3.8409 3.9126 3.8934 3.9279 3.8694 3.8297 3.8726 3.8163 4.1743 3.7960 3.8882 4.4623 3.6760 4.0933 3.9409 4.0037 3.9715 3.8975 3.8995 3.9522 1.0165 1.0359 1.0223 1.0342 1.0215 0.9946 1.0153 1.0389 1.0092 1.0185 1.0142 1.0060 1.0176 1.0117 0.9995 0.9998 1.0015
dispcorr: -0.025899376 hartree
energy: -1531.669998242743
dipole: -40.52298 39.42798 -1.09500 4.10046 -4.02422 0.07624 13.96506 -13.45654 0.50852
magnitude: 1.20972 au
magnitude: 3.07487 debye
