program: Orca
programVersion: 5.0.2
elementType: F F F F F O O N N C C C C C C C C C C C C C C C C C C C C H H H H H H H H H H H H H H H H H
charge: 0
multiplicity: 1
keywords: wb97x-d3
keywords: def2-TZVPP
keywords: def2/J RIJCOSX
keywords: DEFGRID2
keywords: scfconv7
keywords: smallprint printgap noloewdin
keywords: NOSOSCF
formula: C20H17F5N2O2
InChI: InChI=1/C20H17F5N2O2/c21-15-9-8-14(20(23,24)25)17(18(15)22)19(27-29-11-13-6-7-13)26-16(28)10-12-4-2-1-3-5-12/h1-5,8-9,13,26H,6-7,10-11H2
46 atoms
F  1.263514 0.737181 1.950026
F  1.702634 -2.836894 -1.974838
F  1.112723 -0.939758 -2.798211
F  3.102269 -1.689001 -3.125287
F  3.892829 0.943009 2.452451
O  -1.650155 -1.663505 0.000496
O  1.072005 2.001739 -1.259765
N  -0.288976 -1.639124 0.141825
N  -0.558643 0.557637 -0.60358
C  -2.114643 -2.425585 2.256097
C  -3.030886 -1.402678 2.849893
C  -3.238863 -2.854443 3.148047
C  -2.192282 -2.71095 0.785936
C  0.203036 -0.519055 -0.204621
C  1.673365 -0.389497 -0.06024
C  2.595445 -0.9038 -0.969413
C  2.136364 0.234154 1.080355
C  -0.094698 1.753029 -1.089119
C  -1.192887 2.748926 -1.443334
C  3.953128 -0.783874 -0.714211
C  2.124428 -1.594467 -2.218834
C  -2.466869 2.599266 -0.661694
C  3.490386 0.347101 1.334627
C  4.404528 -0.159656 0.437798
C  -3.585386 1.988787 -1.219584
C  -2.528153 3.023959 0.663918
C  -4.73862 1.799276 -0.470127
C  -3.677639 2.838318 1.413368
C  -4.786406 2.222498 0.848296
H  -1.116029 -2.481996 2.67516
H  -3.73404 -0.904439 2.193243
H  -2.641881 -0.766532 3.633605
H  -4.089799 -3.352026 2.698709
H  -2.994141 -3.220408 4.13614
H  -3.233223 -2.79016 0.464175
H  -1.688879 -3.651117 0.542041
H  -1.555886 0.439016 -0.489854
H  -1.387022 2.637896 -2.514452
H  -0.76437 3.743573 -1.315329
H  4.680072 -1.170555 -1.412708
H  5.462291 -0.063461 0.640243
H  -3.555392 1.656542 -2.25077
H  -1.664031 3.498843 1.113689
H  -5.599857 1.323402 -0.920157
H  -3.709443 3.174499 2.441269
H  -5.684586 2.078276 1.4340
totalener: -1531.64738582 hartree
nucrepener: 2944.65555960 hartree
electener: -4476.30294542 hartree
oneelecener: -7958.57949760 hartree
twoeener: 3482.27655218 hartree
kineticenergy: 1525.83688440 hartree
xcener: -138.193025690576 hartree
chargesum: -0.0000000
charge: -0.191622 -0.157959 -0.169504 -0.173225 -0.183977 -0.243044 -0.367097 -0.154443 -0.181816 -0.071922 -0.130996 -0.156568 0.060331 0.269865 -0.073246 -0.098464 0.259969 0.310177 -0.106739 -0.077170 0.524839 -0.013730 0.169447 -0.158338 -0.170924 -0.154814 -0.105890 -0.108262 -0.142444 0.082179 0.059980 0.076261 0.063694 0.077944 0.070448 0.086620 0.175531 0.099724 0.115574 0.131189 0.128448 0.119689 0.120791 0.129226 0.129658 0.130614
qa: -0.1916 -0.1580 -0.1695 -0.1732 -0.1840 -0.2430 -0.3671 -0.1544 -0.1818 -0.0719 -0.1310 -0.1566 0.0603 0.2699 -0.0732 -0.0985 0.2600 0.3102 -0.1067 -0.0772 0.5248 -0.0137 0.1694 -0.1583 -0.1709 -0.1548 -0.1059 -0.1083 -0.1424 0.0822 0.0600 0.0763 0.0637 0.0779 0.0704 0.0866 0.1755 0.0997 0.1156 0.1312 0.1284 0.1197 0.1208 0.1292 0.1297 0.1306
va: 1.1165 1.1440 1.1336 1.1297 1.1178 1.9545 2.1380 2.8907 3.2596 3.8024 3.9015 3.9470 3.9296 3.8735 3.8707 3.8183 3.8868 4.1482 3.8191 3.9150 4.4667 3.6644 4.0797 3.9278 3.9628 4.0118 3.9376 3.9187 3.9408 1.0208 1.0254 1.0229 1.0208 1.0195 0.9998 1.0151 1.0395 1.0084 1.0188 1.0141 1.0057 1.0102 1.0092 0.9996 1.0000 0.9993
dispcorr: -0.024186208 hartree
energy: -1531.671572025838
dipole: -41.45885 40.32409 -1.13475 3.97066 -3.78431 0.18635 15.77046 -15.29173 0.47873
magnitude: 1.24562 au
magnitude: 3.16612 debye
