program: Gaussian 09
title: 000064031
version: EM64L-G09RevD.01
frameworkgroup: C1[X(C16H13FN2O2)]
method: RPBEPBE
basis: SDD
operation: Freq
keyword: #p
keyword: freq=noraman
keyword: PBEPBE/SDD
title: #p freq=noraman PBEPBE/SDD
converged: YES YES NO NO
title: Mulliken charges:
elementType: F O O N N C C C C C C C C C C C C C C C C H H H H H H H H H H H H H
charge: -0.201265 -0.230898 -0.262300 -0.349980 -0.040379 0.201849 0.464378 0.106483 0.124844 0.035703 -0.479703 -0.327577 -0.332025 -0.766136 -0.315216 0.336017 -0.344044 -0.347304 -0.352064 0.327843 -0.538370 0.296351 0.252737 0.247766 0.251725 0.248853 0.266130 0.265868 0.256260 0.245457 0.261164 0.249467 0.221466 0.226899
chargesum: 0.00000
title: Mulliken charges with hydrogens summed into heavy atoms:
elementType: F O O N N C C C C C C C C C C C C C C C C
charge: -0.201265 -0.230898 -0.262300 -0.349980 -0.040379 0.201849 0.464378 0.106483 0.124844 0.035703 -0.183351 -0.074841 -0.084259 0.000573 -0.049348 0.336017 -0.087784 -0.101847 -0.090899 0.327843 0.159462
polarizability: 3.19383907e+02 4.77736622e+00 1.67514573e+02 5.53765101e-02 1.71114469e+00 1.21352813e+02
1716.lowfreq: -2.1431 0.0006 0.0007 0.0009 4.2181 9.7040 20.6374 34.1157 42.1126
frequency: 20.4748 33.9920 42.1017 79.3709 103.9108 126.0814 151.4503 163.2736 170.3569 198.0048 216.0974 222.9971 249.0226 251.3090 322.1994 373.5985 381.1661 382.9211 400.8900 418.0981 419.0007 445.7393 468.0176 514.8249 527.6542 542.5539 560.7440 579.7519 611.7058 621.3329 642.5174 657.4058 701.1177 713.1585 742.8054 778.8183 787.2661 810.9397 829.8363 838.9270 848.9322 910.7412 917.7348 939.6908 963.3872 964.6322 985.2080 989.5174 1002.1956 1021.5258 1046.3379 1076.6757 1106.8516 1108.8467 1114.5379 1137.9893 1156.7576 1175.8829 1203.8405 1226.3774 1238.0336 1250.7069 1270.9190 1295.2958 1312.0582 1372.9454 1394.1977 1396.1129 1419.6401 1428.4491 1438.7582 1449.7390 1462.3415 1465.7826 1469.9158 1472.8616 1499.0103 1561.8360 1568.8787 1587.1454 1616.6262 1622.1178 1625.1643 2963.9698 2998.8633 3053.7632 3077.3450 3130.1166 3134.7236 3146.3290 3147.8660 3163.7411 3171.7439 3175.2485 3175.7902 3183.5260
redmass: 3.7959 6.9291 5.5035 4.9229 3.6988 4.8225 1.9020 1.9990 3.9312 4.3527 4.1305 3.6640 1.5691 3.3662 4.0774 7.9682 5.6679 5.0570 6.4906 3.7034 4.2839 3.9771 4.2424 3.5188 4.1402 8.2863 3.9463 4.9882 4.6810 4.7402 5.9405 6.7360 6.1178 4.7613 4.8625 6.1613 3.5119 1.3490 1.7328 1.6704 4.1376 1.4924 3.7702 1.4532 1.3579 1.3443 6.9281 4.5958 2.6140 2.2918 1.5474 2.3882 1.6247 1.3460 1.2594 2.3868 1.3147 1.1861 2.3549 3.1055 2.7187 6.2608 2.5482 1.2985 5.8085 6.1073 7.2419 1.3099 3.9129 4.1257 1.1811 1.1578 1.0679 3.0303 1.0497 1.0891 2.5103 7.0454 8.2727 7.5505 10.6841 6.8848 7.5712 1.0330 1.0380 1.1041 1.0968 1.0996 1.0991 1.0898 1.0891 1.0886 1.0952 1.0966 1.0931 1.0981
irintensity: 1.0912 1.0416 0.5311 0.5929 3.3856 0.8419 0.5365 1.2409 3.4455 1.0986 4.9644 2.4722 1.2346 3.2345 2.6666 6.8149 3.6467 0.7176 0.2793 0.5689 1.7284 2.1190 1.6533 6.0614 22.8254 1.4950 10.3769 7.1058 30.7849 4.2433 2.2205 3.9889 1.8333 11.7027 29.4110 15.3251 0.6741 8.6384 23.1757 55.4619 15.8382 20.7042 27.3293 0.3120 0.3711 0.6079 43.2127 2.3867 13.8129 2.2469 3.5759 14.0062 18.4428 15.2323 0.2965 11.7834 4.5133 71.4024 7.2478 191.2656 87.5519 85.6633 33.2247 1.0827 85.0335 3.6871 43.1773 19.1932 2.3176 7.4074 16.1328 29.6031 27.2629 242.8039 13.9541 54.5586 170.5727 165.1669 46.8801 7.1046 300.5161 68.1380 10.1073 65.0299 13.3107 43.6561 8.1525 25.1892 10.4776 3.0566 12.0637 1.8399 9.0422 2.2731 4.3039 6.1906
temp: 298.150 k
press: 1.00000 atm
elementType: 9 8 8 7 7 6 6 6 6 6 6 6 6 6 6 6 6 6 6 6 6 1 1 1 1 1 1 1 1 1 1 1 1 1
symmnumber: 1
zpe: 668357.6 jmol-1
zpe.correction: 0.254564 hartree
zpe.thermalcorrener: 0.272525 hartree
zpe.thermalcorrenthalpy: 0.273469 hartree
zpe.thermalcorrgfe: 0.207439 hartree
zpe.sumelectzpe: -975.836089 hartree
zpe.sumelectthermal: -975.818128 hartree
zpe.sumelectthermalent: -975.817184 hartree
zpe.sumelectthermalfe: -975.883214 hartree
dipole: -4.1034 2.8076 -1.6644
dipole: 5.2431
quadrupole: -103.3811 -128.4003 -114.9159
quadrupole: 9.2430 9.4991 3.2223
quadrupole: 12.1847 -12.8345 0.6498 9.2430 9.4991 3.2223
hfenergy: -976.090653 hartree
pointgroup: C01 [X(C16H13F1N2O2)]
dipole: 1.6021275 1.1550985 0.5950691 debye
polarizability: 319.4099611|-3.8209429|167.0337788|2.2490388|-4.7866417|121.8075534 unknown
InChI: InChI=1S/C16H13FN2O2/c1-10-18-15-8-3-11(17)9-14(15)16(20)19(10)12-4-6-13(21-2)7-5-12/h3-9H,1-2H3
charge 0 multiplicity 1
34 atoms
F  -5.512776 -2.098322 0.075892
O  -0.321754 -1.887947 0.01566
O  5.649877 -0.545204 -0.317062
N  0.07047 0.435416 -0.012979
N  -1.723247 2.047659 0.024232
C  -2.232533 -0.384488 0.032799
C  1.505525 0.183345 -0.058909
C  -0.429267 1.760492 0.001022
C  -0.794463 -0.716922 0.013086
C  -2.645306 0.986188 0.03482
C  -3.191165 -1.429935 0.047333
C  2.179738 0.179831 -1.302711
C  2.213708 -0.078227 1.130099
C  0.568256 2.893297 -0.004834
C  -4.036369 1.292178 0.050856
C  -4.541309 -1.07871 0.062157
C  3.562404 -0.063437 -1.352268
C  3.60312 -0.326907 1.093156
C  -4.990321 0.263825 0.064087
C  4.279111 -0.315531 -0.153598
C  6.437202 -0.854484 0.880713
H  -2.861162 -2.472668 0.045574
H  1.61804 0.352746 -2.226803
H  1.678262 -0.101642 2.084986
H  1.176647 2.8980 -0.926731
H  1.272745 2.819844 0.842648
H  0.007707 3.836321 0.062839
H  -4.33263 2.344701 0.052294
H  4.106184 -0.074727 -2.301203
H  4.135809 -0.533169 2.02557
H  -6.063531 0.474819 0.075844
H  7.462815 -1.009474 0.516078
H  6.42062 -0.013918 1.601386
H  6.072191 -1.776351 1.372967
