program: Gaussian 09
title: 000064018
version: EM64L-G09RevD.01
frameworkgroup: C1[X(C10H10N2O)]
method: RPBEPBE
basis: SDD
operation: Freq
keyword: #p
keyword: freq=noraman
keyword: PBEPBE/SDD
title: #p freq=noraman PBEPBE/SDD
converged: NO NO NO NO
title: Mulliken charges:
elementType: O N N C C C C C C C C C C H H H H H H H H H H
charge: -0.272694 -0.205034 -0.050995 0.155021 0.066223 0.149125 0.164107 -0.323513 -0.619230 -0.351169 -0.752050 -0.243305 -0.204674 0.270990 0.288917 0.234186 0.234017 0.259777 0.230556 0.230445 0.273476 0.233170 0.232655
chargesum: 0.00000
title: Mulliken charges with hydrogens summed into heavy atoms:
elementType: O N N C C C C C C C C C C
charge: -0.272694 -0.205034 -0.050995 0.155021 0.066223 0.149125 0.164107 -0.052523 0.137891 -0.091393 -0.017574 -0.010135 0.027980
polarizability: 1.87682949e+02 9.40194130e-01 1.33123769e+02 -8.39858002e-03 -7.06835179e-03 5.79495807e+01
1716.lowfreq: -6.2147 -0.0008 -0.0005 0.0007 11.7533 13.7744 83.7133 89.6814 103.1085
frequency: 83.4751 89.6369 103.0945 157.7474 219.7478 257.5120 278.4478 303.1519 330.5330 378.0858 427.8992 441.5620 449.6295 521.8792 542.9421 593.8494 631.3545 648.3959 678.4689 688.1023 784.5211 795.9692 849.3192 877.7104 897.6820 980.6208 981.9162 1003.3312 1012.2336 1031.5226 1047.1261 1097.5751 1118.9607 1137.7632 1163.3065 1194.1279 1230.2309 1250.6599 1289.0724 1322.9272 1392.0696 1398.2126 1424.1626 1443.6526 1455.2365 1458.3750 1467.3144 1474.4575 1498.9522 1563.4129 1564.3100 1610.4834 1620.3897 2988.5401 2997.2796 3065.8187 3090.3900 3114.8413 3132.9016 3133.5406 3148.5417 3164.2364 3173.2478
redmass: 1.1238 3.1841 3.2512 4.3306 1.1397 4.0862 4.1829 3.9975 2.8967 4.2181 5.9713 3.3657 6.0171 3.4226 7.9631 4.5530 3.9541 5.6817 6.2237 4.2469 1.5271 3.3765 5.0822 4.1404 1.5126 1.3727 3.7977 1.3301 1.8762 1.7967 1.5445 2.0736 1.3154 2.5108 1.1745 2.3539 2.4729 4.0195 1.9407 3.3197 7.1942 1.2996 1.2742 1.2315 2.3625 2.3934 1.0463 1.0913 1.0453 6.9072 6.6474 9.4156 7.2003 1.0391 1.0331 1.0973 1.1026 1.1005 1.0863 1.0977 1.0901 1.0955 1.0996
irintensity: 2.0376 5.6843 3.5402 0.0521 0.0611 3.1655 0.0005 1.8690 0.0796 9.4240 3.6497 1.2252 0.1562 2.5416 2.0769 3.6322 3.2130 9.8844 2.2525 20.3669 79.9504 1.5861 4.2741 1.5827 0.7501 3.3987 23.8801 0.0404 16.8903 6.2201 3.5985 4.6485 0.0175 42.2978 0.3925 0.2411 6.3158 16.6366 5.8093 54.3418 28.7523 28.0494 74.7931 25.3681 35.1507 17.3906 6.6677 25.7903 37.2380 3.4294 212.5569 315.1985 24.8326 9.5884 55.8141 13.6274 22.9762 0.8729 5.7418 5.1513 8.1477 11.5183 20.3566
temp: 298.150 k
press: 1.00000 atm
elementType: 8 7 7 6 6 6 6 6 6 6 6 6 6 1 1 1 1 1 1 1 1 1 1
symmnumber: 1
zpe: 474154.6 jmol-1
zpe.correction: 0.180596 hartree
zpe.thermalcorrener: 0.191577 hartree
zpe.thermalcorrenthalpy: 0.192522 hartree
zpe.thermalcorrgfe: 0.143986 hartree
zpe.sumelectzpe: -570.896898 hartree
zpe.sumelectthermal: -570.885917 hartree
zpe.sumelectthermalent: -570.884972 hartree
zpe.sumelectthermalfe: -570.933508 hartree
dipole: 1.5193 -1.6760 0.0004
dipole: 2.2622
quadrupole: -54.3636 -84.4258 -78.0580
quadrupole: -2.0190 0.0005 -0.0040
quadrupole: 17.9188 -12.1433 -5.7755 -2.0190 0.0005 -0.0040
hfenergy: -571.0774939 hartree
pointgroup: C01 [X(C10H10N2O1)]
dipole: -0.5960182 -0.6609701 -0.0000296 debye
dipolederiv: -0.5434147 0.1282495 0.0000034 0.1918966 -1.2368634 0.0000329 -0.0002741 0.0007472 -0.3636069 -0.6482849 -0.3965555 0.0002419 0.333093 -0.9918978 0.0001666 -0.0010778 0.0000792 -0.1382281 -1.1406782 -0.0894725 -0.000056 0.1654573 -0.480248 0.0001439 -0.0001528 0.0001006 -0.2632316 -0.3778707 0.3221599 -0.0001314 0.0962495 -0.2943393 0.0000456 0.0001444 0.0000522 -0.0061331 0.7705125 0.2142542 -0.0000856 0.0134663 0.1341505 0.0000234 0.0000068 -0.0000509 0.0735916 0.9571224 0.082456 0.0002396 -0.505481 0.884721 -0.0001947 0.0012415 0.0000574 0.0736121 0.8829901 0.0639739 -0.0000408 -0.1339282 1.4788346 -0.0001203 -0.0001021 -0.0006107 0.1937677 -0.0400836 -0.1908447 0.0000159 0.0940509 0.0513277 -0.000007 0.0000342 -0.0000315 -0.1051581 0.3415007 -0.0730892 -0.000366 -0.2132117 0.039797 0.0003608 0.0003009 0.0004857 0.2114996 -0.3884665 -0.1230253 0.0000414 -0.0097697 0.1305576 -0.000086 0.000023 -0.0000228 -0.1570539 -0.2510803 -0.147305 -0.0001344 -0.0708628 -0.0681072 0.0000067 -0.0010626 -0.0002979 0.0521567 0.023641 0.214102 -0.0001093 0.043797 -0.1448203 -0.0000481 -0.0000924 -0.0000732 -0.1719866 0.1889896 -0.0260481 -0.0000332 -0.0272956 0.1519204 -0.0000719 -0.0000396 -0.0000669 -0.1340709 0.1075631 0.0299173 0.0000012 -0.0369483 -0.0170237 0.0000262 0.0000358 0.0000313 0.1551941 0.1986665 -0.0794519 0.0004011 0.0911598 0.001057 0.0005867 0.0001207 0.0003277 0.1343751 -0.0497563 0.0116834 0.059476 -0.028817 0.1052131 0.0879605 0.1083962 0.0463203 -0.0496126 -0.0496306 0.0110842 -0.0595155 -0.0300325 0.1048098 -0.0889284 -0.1080142 -0.0472895 -0.0483289 0.0995867 -0.022792 0.000018 0.0247846 -0.0582671 0.0000533 -0.0000293 0.0000405 0.1611335 -0.0134569 -0.0145811 -0.078577 0.0016802 0.0904478 0.0755705 -0.1174229 0.0316588 -0.0321696 -0.0139463 -0.0140913 0.0787785 0.0024327 0.0900158 -0.0760517 0.1177784 -0.0320388 -0.0311932 0.1110971 0.092154 -0.0002271 -0.0023623 -0.0529134 0.0004646 0.0000911 0.0004986 0.1279659 -0.0764854 -0.0840199 0.0000544 -0.0958923 0.0340901 0.0000515 0.0000709 0.0000685 0.1627157 -0.0885154 0.0912422 0.0000051 0.0965335 0.0475379 0.0000151 0.0000239 0.000014 0.1547616 unknown
polarizability: 187.687508|-0.7970203|133.1192091|-0.0034999|-0.011639|57.9495814 unknown
InChI: InChI=1S/C10H10N2O/c1-7-11-9-6-4-3-5-8(9)10(13)12(7)2/h3-6H,1-2H3
charge 0 multiplicity 1
23 atoms
O  -0.773028 2.519075 -0.000989
N  -1.781113 0.392043 -0.000169
N  -0.491318 -1.648297 0.000621
C  0.658552 0.553109 0.000003
C  0.686708 -0.878312 0.000359
C  -1.656376 -1.014934 0.000278
C  -0.633753 1.257585 0.000152
C  1.869351 1.293706 -0.000372
C  -3.110396 1.044194 -0.000643
C  1.942012 -1.547199 0.000366
C  -2.924238 -1.835361 -0.000061
C  3.101966 0.619988 -0.000373
C  3.134107 -0.803857 -0.000005
H  1.807445 2.386894 -0.000577
H  -2.933194 2.131069 -0.004355
H  -3.684079 0.769956 0.901144
H  -3.686362 0.763656 -0.898958
H  1.941987 -2.641245 0.000629
H  -3.545387 -1.634305 -0.892557
H  -3.548767 -1.630232 0.889093
H  -2.637015 -2.896395 0.002709
H  4.03865 1.187529 -0.000679
H  4.098349 -1.324568 -0.000018
