program: Orca
programVersion: 5.0.3
elementType: S N N N N N C C C C C C C C C C H H H H H H H H H H H H H H H H H H H
charge: 0
multiplicity: 1
keywords: wb97x-d3
keywords: def2-TZVPP
keywords: def2/J RIJCOSX
keywords: DEFGRID2
keywords: scfconv7
keywords: smallprint printgap noloewdin
keywords: NOSOSCF
formula: C10H19N5S
InChI: InChI=1/C10H19N5S/c1-6-11-7-12-8(15-10(2,3)4)14-9(13-7)16-5/h11,15H,6H2,1-5H3
35 atoms
S  -1.911355 3.189256 -0.085174
N  1.946256 0.11884 -0.05174
N  -0.141804 -0.810898 0.264199
N  0.155713 1.518393 -0.053681
N  -2.26898 -1.606772 0.578356
N  -2.017853 0.638061 0.245666
C  2.742055 -1.114649 -0.050759
C  2.342013 -2.031786 -1.206049
C  4.190475 -0.673188 -0.24613
C  2.625096 -1.852685 1.281719
C  0.621991 0.255627 0.057861
C  -1.448613 -0.572982 0.348773
C  -1.862177 -2.994262 0.509736
C  -1.15117 1.618145 0.048725
C  -1.717156 -3.520322 -0.90819
C  -0.521971 4.303142 -0.353302
H  2.438805 -1.520265 -2.165097
H  2.99583 -2.905009 -1.228922
H  1.317119 -2.386148 -1.108974
H  4.521954 -0.02082 0.56403
H  4.320888 -0.138691 -1.1893
H  4.847167 -1.542315 -0.263566
H  1.614085 -2.213727 1.459422
H  3.292175 -2.7161 1.284473
H  2.912232 -1.208541 2.114219
H  2.444614 0.977005 -0.229797
H  -3.25488 -1.407843 0.515074
H  -0.929086 -3.117963 1.057479
H  -2.61468 -3.572954 1.043932
H  -0.962236 -2.965353 -1.465312
H  -1.41647 -4.568542 -0.891926
H  -2.659807 -3.451646 -1.452303
H  0.161463 4.307673 0.492048
H  -0.953667 5.297748 -0.455862
H  0.01767 4.065189 -1.266301
elementType: S N C H
totalener: -1064.60408094 hartree
nucrepener: 1280.48236084 hartree
electener: -2345.08644178 hartree
oneelecener: -3997.80505805 hartree
twoeener: 1652.71861626 hartree
cpcmener: -0.02282908 hartree
kineticenergy: 1060.91521288 hartree
xcener: -84.955589250609 hartree
chargesum: -0.0000000
charge: -0.055636 -0.207609 -0.460417 -0.455918 -0.213850 -0.423565 0.263436 -0.326770 -0.299214 -0.334976 0.399734 0.364174 0.009384 0.238539 -0.275228 -0.251292 0.097880 0.097618 0.092970 0.107172 0.105389 0.092231 0.106020 0.096996 0.097402 0.154677 0.167998 0.083633 0.101068 0.086874 0.090786 0.093394 0.114046 0.130205 0.112852
qa: -0.0556 -0.2076 -0.4604 -0.4559 -0.2139 -0.4236 0.2634 -0.3268 -0.2992 -0.3350 0.3997 0.3642 0.0094 0.2385 -0.2752 -0.2513 0.0979 0.0976 0.0930 0.1072 0.1054 0.0922 0.1060 0.0970 0.0974 0.1547 0.1680 0.0836 0.1011 0.0869 0.0908 0.0934 0.1140 0.1302 0.1129
va: 2.3988 3.2069 2.9173 2.9661 3.1849 2.9714 3.7999 3.9160 3.8905 3.9009 4.2072 4.2779 3.8716 4.2753 3.9147 3.9714 1.0100 1.0068 1.0082 1.0055 1.0050 1.0076 1.0126 1.0054 1.0093 1.0327 1.0210 1.0036 0.9987 0.9991 1.0080 1.0051 1.0088 1.0021 1.0097
dispcorr: -0.015068490 hartree
energy: -1064.619149431396
dipole: 17.43947 -16.01989 1.41958 -18.14490 17.06767 -1.07723 -3.10040 2.82037 -0.28003
magnitude: 1.80390 au
magnitude: 4.58514 debye
