program: Orca
programVersion: 5.0.3
elementType: S N N N N N C C C C C C C C C C H H H H H H H H H H H H H H H H H H H
charge: 0
multiplicity: 1
keywords: wb97x-d3
keywords: def2-TZVPP
keywords: def2/J RIJCOSX
keywords: DEFGRID2
keywords: scfconv7
keywords: smallprint printgap noloewdin
keywords: NOSOSCF
formula: C10H19N5S
InChI: InChI=1/C10H19N5S/c1-6-11-7-12-8(15-10(2,3)4)14-9(13-7)16-5/h11,15H,6H2,1-5H3
35 atoms
S  -1.280561 2.953063 0.059622
N  1.676656 -1.027478 -0.076859
N  -0.562721 -1.367748 -0.231581
N  0.300521 0.827449 -0.013835
N  -2.838245 -1.619696 -0.458194
N  -2.031458 0.493922 -0.194255
C  2.971966 -0.34342 0.023917
C  3.097371 0.426622 1.337454
C  4.02354 -1.449779 -0.003801
C  3.208267 0.587363 -1.16499
C  0.448886 -0.501619 -0.108087
C  -1.77404 -0.825503 -0.280884
C  -2.817387 -3.064074 -0.384772
C  -0.95053 1.237498 -0.061406
C  -3.014768 -3.599085 1.023495
C  0.367794 3.668008 0.196271
H  2.392876 1.25447 1.393981
H  2.928939 -0.227634 2.194322
H  4.103173 0.839986 1.42742
H  5.021675 -1.017899 0.060857
H  3.969614 -2.026984 -0.929074
H  3.903247 -2.138553 0.834701
H  4.213419 1.007975 -1.109266
H  3.126326 0.047036 -2.109458
H  2.502804 1.416178 -1.181692
H  1.70458 -2.031681 -0.164463
H  -3.736522 -1.168626 -0.382603
H  -3.609226 -3.435909 -1.035486
H  -1.878923 -3.423022 -0.801245
H  -3.972486 -3.278743 1.435699
H  -3.003003 -4.689568 1.017978
H  -2.225321 -3.258214 1.694263
H  0.971241 3.457058 -0.68317
H  0.88342 3.324397 1.089505
H  0.222555 4.744949 0.269226
elementType: S N C H
totalener: -1064.60370521 hartree
nucrepener: 1276.20814168 hartree
electener: -2340.81184689 hartree
oneelecener: -3989.27561278 hartree
twoeener: 1648.46376589 hartree
cpcmener: -0.02266552 hartree
kineticenergy: 1060.90978965 hartree
xcener: -84.954474199577 hartree
chargesum: 0.0000000
charge: -0.056477 -0.205700 -0.472604 -0.440433 -0.207929 -0.423951 0.257931 -0.333336 -0.298182 -0.332763 0.400780 0.384722 0.013576 0.212581 -0.259897 -0.268757 0.102786 0.098211 0.097574 0.092323 0.105449 0.106722 0.097016 0.098216 0.101433 0.154740 0.166252 0.095733 0.079609 0.085277 0.088975 0.081577 0.118484 0.119463 0.140601
qa: -0.0565 -0.2057 -0.4726 -0.4404 -0.2079 -0.4240 0.2579 -0.3333 -0.2982 -0.3328 0.4008 0.3847 0.0136 0.2126 -0.2599 -0.2688 0.1028 0.0982 0.0976 0.0923 0.1054 0.1067 0.0970 0.0982 0.1014 0.1547 0.1663 0.0957 0.0796 0.0853 0.0890 0.0816 0.1185 0.1195 0.1406
va: 2.3915 3.2058 2.9527 2.9231 3.1873 2.9681 3.7989 3.9048 3.8878 3.9076 4.2033 4.2457 3.8573 4.3107 3.9322 3.9734 1.0122 1.0098 1.0050 1.0076 1.0053 1.0055 1.0051 1.0095 1.0126 1.0330 1.0218 0.9972 1.0229 1.0042 1.0081 1.0062 1.0007 1.0001 1.0028
dispcorr: -0.014843275 hartree
energy: -1064.618548480536
dipole: 16.82260 -15.59415 1.22844 -10.03815 8.88877 -1.14938 2.95781 -2.85250 0.10531
magnitude: 1.68559 au
magnitude: 4.28444 debye
