program: Orca
programVersion: 5.0.3
elementType: S N N N N N C C C C C C C C C C H H H H H H H H H H H H H H H H H H H
charge: 0
multiplicity: 1
keywords: wb97x-d3
keywords: def2-TZVPP
keywords: def2/J RIJCOSX
keywords: DEFGRID2
keywords: scfconv7
keywords: smallprint printgap noloewdin
keywords: NOSOSCF
formula: C10H19N5S
InChI: InChI=1/C10H19N5S/c1-6-11-7-12-8(15-10(2,3)4)14-9(13-7)16-5/h11,15H,6H2,1-5H3
35 atoms
S  -1.361442 3.393465 -0.303511
N  2.137147 0.043702 -0.192409
N  0.002386 -0.752927 0.194463
N  0.430383 1.538344 -0.224655
N  -2.16284 -1.389138 0.611385
N  -1.777611 0.816225 0.192846
C  2.892423 -1.203203 -0.032318
C  2.750141 -1.758264 1.384811
C  2.470286 -2.247454 -1.065453
C  4.353951 -0.829847 -0.273763
C  0.824288 0.261289 -0.066326
C  -1.280607 -0.427873 0.322272
C  -1.861841 -2.800411 0.695312
C  -0.867824 1.725885 -0.082972
C  -1.976094 -3.521772 -0.637418
C  -3.147742 3.312369 -0.079996
H  1.726806 -2.058581 1.604254
H  3.388502 -2.634649 1.509007
H  3.054647 -1.017392 2.12643
H  2.561712 -1.853981 -2.079427
H  1.442171 -2.574384 -0.919175
H  3.113327 -3.126126 -0.990625
H  4.505561 -0.438141 -1.281942
H  4.696972 -0.076485 0.438899
H  4.991143 -1.706476 -0.159163
H  2.674538 0.875292 -0.384388
H  -3.130231 -1.107108 0.63422
H  -0.862064 -2.923146 1.108786
H  -2.555016 -3.237828 1.414628
H  -1.753678 -4.582816 -0.514836
H  -2.984166 -3.438502 -1.046468
H  -1.27824 -3.117268 -1.371626
H  -3.615671 2.661924 -0.815161
H  -3.515921 4.326911 -0.228599
H  -3.416396 2.989126 0.922918
elementType: S N C H
totalener: -1064.61492863 hartree
nucrepener: 1274.34269690 hartree
electener: -2338.95762553 hartree
oneelecener: -3985.53731066 hartree
twoeener: 1646.57968513 hartree
cpcmener: -0.01984236 hartree
kineticenergy: 1060.90143476 hartree
xcener: -84.952639666021 hartree
chargesum: 0.0000000
charge: -0.052082 -0.205305 -0.462288 -0.428892 -0.208751 -0.445575 0.253073 -0.330371 -0.321756 -0.297776 0.405791 0.366027 -0.002543 0.236977 -0.261162 -0.252462 0.104603 0.095284 0.097186 0.096367 0.097669 0.096052 0.106628 0.105237 0.091155 0.151262 0.166876 0.086063 0.099608 0.089063 0.089328 0.081283 0.112746 0.128366 0.112319
qa: -0.0521 -0.2053 -0.4623 -0.4289 -0.2088 -0.4456 0.2531 -0.3304 -0.3218 -0.2978 0.4058 0.3660 -0.0025 0.2370 -0.2612 -0.2525 0.1046 0.0953 0.0972 0.0964 0.0977 0.0961 0.1066 0.1052 0.0912 0.1513 0.1669 0.0861 0.0996 0.0891 0.0893 0.0813 0.1127 0.1284 0.1123
va: 2.3959 3.1953 2.9244 2.9812 3.1889 2.9534 3.8138 3.9072 3.9056 3.8886 4.2130 4.2565 3.8788 4.2766 3.9216 3.9708 1.0123 1.0056 1.0094 1.0102 1.0108 1.0061 1.0055 1.0052 1.0083 1.0366 1.0222 1.0043 0.9978 1.0082 1.0055 1.0040 1.0098 1.0025 1.0097
dispcorr: -0.014762937 hartree
energy: -1064.629691562634
dipole: 8.79729 -9.04653 -0.24924 -21.65339 20.00797 -1.64542 -0.04453 0.28753 0.24300
magnitude: 1.68184 au
magnitude: 4.27489 debye
