program: Orca
programVersion: 5.0.3
elementType: S N N N N N C C C C C C C C C C H H H H H H H H H H H H H H H H H H H
charge: 0
multiplicity: 1
keywords: wb97x-d3
keywords: def2-TZVPP
keywords: def2/J RIJCOSX
keywords: DEFGRID2
keywords: scfconv7
keywords: smallprint printgap noloewdin
keywords: NOSOSCF
formula: C10H19N5S
InChI: InChI=1/C10H19N5S/c1-6-11-7-12-8(15-10(2,3)4)14-9(13-7)16-5/h11,15H,6H2,1-5H3
35 atoms
S  -0.685254 3.064218 -0.122718
N  1.804334 -1.135592 0.070913
N  -0.453825 -1.303611 0.221185
N  0.571694 0.817102 -0.013725
N  -2.742138 -1.384339 0.43196
N  -1.776459 0.662202 0.185442
C  3.148335 -0.560504 -0.047782
C  3.461359 0.372624 1.121847
C  4.105329 -1.749569 -0.001438
C  3.321954 0.170454 -1.378548
C  0.620477 -0.515167 0.091688
C  -1.619539 -0.675487 0.272076
C  -2.839948 -2.826012 0.414091
C  -0.651132 1.320826 0.038372
C  -3.266478 -3.372937 -0.937962
C  -2.447605 3.433253 -0.049773
H  4.4934 0.721675 1.054677
H  2.81426 1.248168 1.129796
H  3.34726 -0.143849 2.076878
H  3.921771 -2.444853 -0.823691
H  4.01051 -2.300912 0.936976
H  5.137047 -1.407342 -0.080979
H  4.353642 0.510324 -1.486168
H  3.099634 -0.489165 -2.219235
H  2.675512 1.043461 -1.45089
H  1.746275 -2.138229 0.162913
H  -3.600183 -0.855233 0.408512
H  -1.878609 -3.242259 0.707336
H  -3.559311 -3.124326 1.178639
H  -4.236096 -2.973429 -1.239225
H  -2.541886 -3.125638 -1.71455
H  -3.35532 -4.459502 -0.897024
H  -2.883876 3.134075 0.900507
H  -2.990105 2.964235 -0.867615
H  -2.535432 4.514933 -0.148344
elementType: S N C H
totalener: -1064.61492269 hartree
nucrepener: 1266.33326436 hartree
electener: -2330.94818705 hartree
oneelecener: -3969.71058275 hartree
twoeener: 1638.76239570 hartree
cpcmener: -0.01905659 hartree
kineticenergy: 1060.90576511 hartree
xcener: -84.953421821291 hartree
chargesum: 0.0000000
charge: -0.052911 -0.206110 -0.470576 -0.423082 -0.203688 -0.446123 0.248485 -0.328435 -0.295572 -0.328911 0.411086 0.378230 0.003888 0.226382 -0.252937 -0.248570 0.095123 0.102757 0.095414 0.105923 0.105167 0.091210 0.095050 0.095700 0.103301 0.151697 0.164745 0.084512 0.092351 0.082598 0.082445 0.087001 0.112645 0.113252 0.127953
qa: -0.0529 -0.2061 -0.4706 -0.4231 -0.2037 -0.4461 0.2485 -0.3284 -0.2956 -0.3289 0.4111 0.3782 0.0039 0.2264 -0.2529 -0.2486 0.0951 0.1028 0.0954 0.1059 0.1052 0.0912 0.0951 0.0957 0.1033 0.1517 0.1647 0.0845 0.0924 0.0826 0.0824 0.0870 0.1126 0.1133 0.1280
va: 2.4010 3.1929 2.9604 2.9130 3.1884 2.9609 3.8183 3.8919 3.8860 3.8903 4.1930 4.2421 3.8567 4.2562 3.9360 3.9688 1.0051 1.0239 1.0095 1.0054 1.0053 1.0084 1.0052 1.0097 1.0244 1.0351 1.0227 1.0257 0.9969 1.0042 1.0049 1.0087 1.0097 1.0093 1.0025
dispcorr: -0.013948319 hartree
energy: -1064.628871011227
dipole: 7.83988 -8.44780 -0.60792 -11.88186 10.56619 -1.31566 -2.25242 2.31027 0.05784
magnitude: 1.45048 au
magnitude: 3.68682 debye
