program: Orca
programVersion: 5.0.3
elementType: S N N N N N C C C C C C C C C C H H H H H H H H H H H H H H H H H H H
charge: 0
multiplicity: 1
keywords: wb97x-d3
keywords: def2-TZVPP
keywords: def2/J RIJCOSX
keywords: DEFGRID2
keywords: scfconv7
keywords: smallprint printgap noloewdin
keywords: NOSOSCF
formula: C10H19N5S
InChI: InChI=1/C10H19N5S/c1-6-11-7-12-8(15-10(2,3)4)14-9(13-7)16-5/h11,15H,6H2,1-5H3
35 atoms
S  -1.211131 3.461257 0.309959
N  2.126511 -0.042226 0.132954
N  -0.050929 -0.742365 -0.20772
N  0.493356 1.526939 0.194697
N  -2.251413 -1.282301 -0.553769
N  -1.758107 0.903972 -0.146994
C  2.804701 -1.326377 -0.032549
C  2.597571 -1.879742 -1.443976
C  4.291152 -1.042254 0.181661
C  2.333442 -2.33838 1.01328
C  0.818212 0.237393 0.032585
C  -1.317729 -0.353435 -0.291608
C  -1.988348 -2.697852 -0.647042
C  -0.798049 1.776128 0.092714
C  -1.902564 -3.39257 0.704799
C  -3.002645 3.428577 0.111216
H  3.167858 -2.800613 -1.57551
H  1.548776 -2.100141 -1.631445
H  2.936649 -1.164164 -2.194309
H  4.482158 -0.651845 1.183434
H  4.668776 -0.321141 -0.546505
H  4.871335 -1.957225 0.068555
H  2.472133 -1.947223 2.021975
H  1.281427 -2.580908 0.881322
H  2.908703 -3.261714 0.92819
H  2.695013 0.769436 0.309975
H  -3.200798 -0.953176 -0.543081
H  -2.784962 -3.138987 -1.248063
H  -1.060549 -2.842761 -1.199886
H  -2.834509 -3.294464 1.262137
H  -1.698938 -4.456294 0.577025
H  -1.101226 -2.965982 1.30661
H  -3.338109 4.45821 0.224367
H  -3.475368 2.812715 0.871673
H  -3.286183 3.065821 -0.873077
totalener: -1064.59045865 hartree
nucrepener: 1279.61341134 hartree
electener: -2344.20386999 hartree
oneelecener: -3995.44188704 hartree
twoeener: 1651.23801705 hartree
kineticenergy: 1060.95007210 hartree
xcener: -84.960359493950 hartree
chargesum: -0.0000000
charge: -0.013728 -0.210534 -0.456917 -0.378814 -0.219346 -0.415813 0.217865 -0.301070 -0.289292 -0.292920 0.418119 0.374248 -0.008685 0.228139 -0.247989 -0.266138 0.081018 0.107727 0.090642 0.102646 0.099380 0.080999 0.090977 0.096977 0.082145 0.135520 0.140653 0.086743 0.081252 0.080294 0.080643 0.089398 0.113257 0.111076 0.111528
qa: -0.0137 -0.2105 -0.4569 -0.3788 -0.2193 -0.4158 0.2179 -0.3011 -0.2893 -0.2929 0.4181 0.3742 -0.0087 0.2281 -0.2480 -0.2661 0.0810 0.1077 0.0906 0.1026 0.0994 0.0810 0.0910 0.0970 0.0821 0.1355 0.1407 0.0867 0.0813 0.0803 0.0806 0.0894 0.1133 0.1111 0.1115
va: 2.4096 3.1830 2.9350 3.0025 3.1746 2.9708 3.8867 3.9019 3.8964 3.9020 4.1698 4.2365 3.9017 4.2773 3.9010 3.9756 1.0080 1.0150 1.0135 1.0065 1.0068 1.0128 1.0141 1.0134 1.0099 1.0508 1.0419 0.9992 1.0076 1.0102 1.0106 1.0055 1.0061 1.0094 1.0099
dispcorr: -0.015012331 hartree
energy: -1064.605470979418
dipole: 8.11015 -8.33641 -0.22626 -22.08997 20.90850 -1.18147 -0.05036 -0.10361 -0.15397
magnitude: 1.21275 au
magnitude: 3.08256 debye
