program: Orca
programVersion: 5.0.3
elementType: S N N N N N C C C C C C C C C C H H H H H H H H H H H H H H H H H H H
charge: 0
multiplicity: 1
keywords: wb97x-d3
keywords: def2-TZVPP
keywords: def2/J RIJCOSX
keywords: DEFGRID2
keywords: scfconv7
keywords: smallprint printgap noloewdin
keywords: NOSOSCF
formula: C10H19N5S
InChI: InChI=1/C10H19N5S/c1-6-11-7-12-8(15-10(2,3)4)14-9(13-7)16-5/h11,15H,6H2,1-5H3
35 atoms
S  -0.668668 3.096022 -0.104936
N  1.731797 -1.158638 0.046817
N  -0.526025 -1.27787 0.220739
N  0.544494 0.821336 -0.015827
N  -2.808075 -1.313379 0.438895
N  -1.806992 0.716351 0.177256
C  3.078741 -0.60192 -0.081085
C  3.406564 0.321747 1.093453
C  4.024764 -1.801593 -0.054886
C  3.241738 0.140944 -1.407928
C  0.560363 -0.507997 0.084208
C  -1.671638 -0.618353 0.270858
C  -2.88327 -2.753852 0.46704
C  -0.666506 1.353704 0.035774
C  -2.887385 -3.391313 -0.915024
C  -2.429883 3.466825 0.005348
H  4.438129 0.669815 1.020077
H  2.754917 1.192636 1.104666
H  3.296937 -0.203702 2.04337
H  3.826301 -2.485117 -0.883264
H  3.935025 -2.358433 0.880581
H  5.058725 -1.470106 -0.141783
H  4.271514 0.483687 -1.521054
H  3.011155 -0.513498 -2.249693
H  2.58823 1.009006 -1.457789
H  1.642691 -2.157062 0.133915
H  -3.654279 -0.773016 0.397451
H  -2.043248 -3.132132 1.048207
H  -3.790545 -3.022944 1.00995
H  -3.728454 -3.039301 -1.512835
H  -1.967212 -3.156532 -1.447961
H  -2.965158 -4.476244 -0.836158
H  -2.843318 3.142245 0.956421
H  -2.982913 2.999684 -0.805004
H  -2.519103 4.548559 -0.075629
totalener: -1064.59118997 hartree
nucrepener: 1272.69070917 hartree
electener: -2337.28189914 hartree
oneelecener: -3981.74546440 hartree
twoeener: 1644.46356526 hartree
kineticenergy: 1060.95661852 hartree
xcener: -84.960841172712 hartree
chargesum: -0.0000000
charge: -0.020064 -0.211678 -0.445112 -0.399108 -0.219076 -0.416169 0.210640 -0.301658 -0.286316 -0.301159 0.421558 0.387284 0.003804 0.225043 -0.241786 -0.260935 0.079849 0.119114 0.085056 0.098880 0.098086 0.082205 0.079980 0.084935 0.119413 0.130370 0.139785 0.078635 0.081579 0.070378 0.091765 0.077573 0.112271 0.111534 0.113322
qa: -0.0201 -0.2117 -0.4451 -0.3991 -0.2191 -0.4162 0.2106 -0.3017 -0.2863 -0.3012 0.4216 0.3873 0.0038 0.2250 -0.2418 -0.2609 0.0798 0.1191 0.0851 0.0989 0.0981 0.0822 0.0800 0.0849 0.1194 0.1304 0.1398 0.0786 0.0816 0.0704 0.0918 0.0776 0.1123 0.1115 0.1133
va: 2.4105 3.1832 2.9651 2.9350 3.1772 2.9778 3.8924 3.8849 3.8876 3.8829 4.1550 4.2150 3.8828 4.2489 3.9030 3.9742 1.0076 1.0227 1.0126 1.0069 1.0069 1.0137 1.0075 1.0128 1.0230 1.0525 1.0417 1.0228 0.9977 1.0103 1.0119 1.0108 1.0097 1.0098 1.0058
dispcorr: -0.014166320 hartree
energy: -1064.605356291024
dipole: 8.39739 -8.84365 -0.44626 -12.25423 11.35135 -0.90288 -2.21413 2.26451 0.05038
magnitude: 1.00841 au
magnitude: 2.56316 debye
