program: Orca
programVersion: 5.0.3
elementType: Cl N N N N N C C C C C C C C C H H H H H H H H H H H H H H H H
charge: 0
multiplicity: 1
keywords: wb97x-d3
keywords: def2-TZVPP
keywords: def2/J RIJCOSX
keywords: DEFGRID2
keywords: scfconv7
keywords: smallprint printgap noloewdin
keywords: NOSOSCF
formula: C9H16ClN5
InChI: InChI=1/C9H16ClN5/c1-5-11-7-12-6(10)13-8(14-7)15-9(2,3)4/h11,15H,5H2,1-4H3
31 atoms
Cl -3.524311 1.605928 -0.194192
N  1.321667 1.486925 -0.098367
N  0.24229 -0.535033 0.187571
N  -0.949187 1.48895 -0.131385
N  -0.964291 -2.460341 0.514699
N  -2.130044 -0.530627 0.172446
C  2.711826 1.020791 -0.015923
C  3.574675 2.267407 -0.194971
C  3.009721 0.400791 1.34855
C  3.029346 0.027243 -1.132808
C  0.198068 0.777524 -0.008026
C  -0.93276 -1.147897 0.278967
C  0.190986 -3.33194 0.479136
C  -2.022585 0.755121 -0.030418
C  0.474451 -3.887487 -0.906114
H  3.376921 3.004959 0.585434
H  4.629889 2.001984 -0.141681
H  3.398714 2.740484 -1.163176
H  4.070911 0.157078 1.41724
H  2.447433 -0.517181 1.510078
H  2.775345 1.095346 2.156637
H  4.090788 -0.223938 -1.111326
H  2.466487 -0.898807 -1.02509
H  2.808591 0.453156 -2.112716
H  1.183839 2.475127 -0.247166
H  1.053728 -2.785405 0.854329
H  0.007885 -4.148463 1.177275
H  -1.874957 -2.892662 0.49047
H  0.676846 -3.089547 -1.621642
H  1.344225 -4.544454 -0.878531
H  -0.370849 -4.469029 -1.276614
elementType: Cl N C H
totalener: -1086.69464824 hartree
nucrepener: 1148.80614125 hartree
electener: -2235.50078949 hartree
oneelecener: -3766.56742961 hartree
twoeener: 1531.06664011 hartree
cpcmener: -0.02186878 hartree
kineticenergy: 1083.25934678 hartree
xcener: -82.525374350286 hartree
chargesum: -0.0000000
charge: -0.069974 -0.193002 -0.451631 -0.413025 -0.197004 -0.405018 0.258604 -0.295765 -0.333504 -0.326447 0.419316 0.381608 0.005418 0.194754 -0.263519 0.107127 0.092319 0.107495 0.097989 0.105469 0.099283 0.098529 0.097263 0.099233 0.157431 0.088079 0.101828 0.172424 0.081453 0.091012 0.092253
qa: -0.0700 -0.1930 -0.4516 -0.4130 -0.1970 -0.4050 0.2586 -0.2958 -0.3335 -0.3264 0.4193 0.3816 0.0054 0.1948 -0.2635 0.1071 0.0923 0.1075 0.0980 0.1055 0.0993 0.0985 0.0973 0.0992 0.1574 0.0881 0.1018 0.1724 0.0815 0.0910 0.0923
va: 1.2339 3.2227 2.9530 2.9698 3.2130 2.9584 3.8004 3.8872 3.9060 3.9088 4.1885 4.2450 3.8722 4.4700 3.9296 1.0048 1.0078 1.0048 1.0051 1.0108 1.0089 1.0055 1.0099 1.0092 1.0312 1.0044 0.9982 1.0178 1.0028 1.0079 1.0045
dispcorr: -0.013330945 hartree
energy: -1086.707979189565
dipole: 35.08230 -32.82493 2.25737 -13.08249 11.85710 -1.22539 -0.95133 1.01429 0.06296
magnitude: 2.56930 au
magnitude: 6.53063 debye
