program: Orca
programVersion: 5.0.3
elementType: Cl N N N N N C C C C C C C C C H H H H H H H H H H H H H H H H
charge: 0
multiplicity: 1
keywords: wb97x-d3
keywords: def2-TZVPP
keywords: def2/J RIJCOSX
keywords: DEFGRID2
keywords: scfconv7
keywords: smallprint printgap noloewdin
keywords: NOSOSCF
formula: C9H16ClN5
InChI: InChI=1/C9H16ClN5/c1-5-11-7-12-6(10)13-8(14-7)15-9(2,3)4/h11,15H,5H2,1-4H3
31 atoms
Cl -3.549145 1.570506 -0.571616
N  1.29886 1.415748 -0.548571
N  0.212268 -0.495045 0.165263
N  -0.971318 1.432169 -0.542508
N  -1.004558 -2.315354 0.850839
N  -2.160224 -0.471125 0.175416
C  2.688069 0.997798 -0.328506
C  3.031663 -0.248098 -1.142665
C  3.55014 2.159664 -0.816495
C  2.958004 0.763804 1.156956
C  0.172165 0.750668 -0.293999
C  -0.967052 -1.067836 0.384704
C  0.152524 -3.154156 1.076106
C  -2.04921 0.747369 -0.279142
C  0.668891 -3.830253 -0.182805
H  2.814719 -0.096762 -2.200917
H  4.096553 -0.466909 -1.049976
H  2.482187 -1.123564 -0.803698
H  3.332783 3.078068 -0.267421
H  3.394896 2.353244 -1.879539
H  4.605308 1.930153 -0.671585
H  2.363959 -0.057544 1.554701
H  4.009822 0.517848 1.311643
H  2.735297 1.658674 1.740323
H  1.155276 2.358743 -0.877918
H  0.940999 -2.560129 1.537584
H  -0.141566 -3.906485 1.807445
H  -1.920453 -2.724322 0.950429
H  0.991503 -3.100532 -0.925479
H  1.524757 -4.463117 0.05557
H  -0.096897 -4.461177 -0.635751
elementType: Cl N C H
totalener: -1086.70406746 hartree
nucrepener: 1150.51944370 hartree
electener: -2237.22351117 hartree
oneelecener: -3769.97249416 hartree
twoeener: 1532.74898299 hartree
cpcmener: -0.01923986 hartree
kineticenergy: 1083.25899029 hartree
xcener: -82.525893343525 hartree
chargesum: 0.0000000
charge: -0.068841 -0.194905 -0.451156 -0.408213 -0.196837 -0.398605 0.252194 -0.321063 -0.297402 -0.326824 0.417879 0.387366 0.002566 0.192634 -0.264311 0.098271 0.098082 0.096968 0.104774 0.108566 0.091766 0.103173 0.096268 0.097786 0.156096 0.084933 0.101340 0.171608 0.084196 0.090384 0.091308
qa: -0.0688 -0.1949 -0.4512 -0.4082 -0.1968 -0.3986 0.2522 -0.3211 -0.2974 -0.3268 0.4179 0.3874 0.0026 0.1926 -0.2643 0.0983 0.0981 0.0970 0.1048 0.1086 0.0918 0.1032 0.0963 0.0978 0.1561 0.0849 0.1013 0.1716 0.0842 0.0904 0.0913
va: 1.2343 3.2142 2.9504 2.9725 3.2008 2.9648 3.8136 3.9029 3.8905 3.9118 4.1887 4.2368 3.8712 4.4726 3.9080 1.0100 1.0070 1.0098 1.0051 1.0050 1.0080 1.0128 1.0050 1.0093 1.0327 1.0045 0.9981 1.0199 1.0029 1.0081 1.0060
dispcorr: -0.013476273 hartree
energy: -1086.717543735994
dipole: 35.48775 -33.32707 2.16068 -12.71963 11.56374 -1.15590 1.88578 -1.50644 0.37934
magnitude: 2.47962 au
magnitude: 6.30270 debye
