program: Orca
programVersion: 5.0.3
elementType: Cl N N N N N C C C C C C C C C H H H H H H H H H H H H H H H H
charge: 0
multiplicity: 1
keywords: wb97x-d3
keywords: def2-TZVPP
keywords: def2/J RIJCOSX
keywords: DEFGRID2
keywords: scfconv7
keywords: smallprint printgap noloewdin
keywords: NOSOSCF
formula: C9H16ClN5
InChI: InChI=1/C9H16ClN5/c1-5-11-7-12-6(10)13-8(14-7)15-9(2,3)4/h11,15H,5H2,1-4H3
31 atoms
Cl -3.359037 0.901341 -0.54926
N  1.395255 1.707552 -0.091845
N  0.697193 -0.474909 0.215164
N  -0.822697 1.274243 -0.278829
N  -0.123391 -2.578362 0.521524
N  -1.622809 -0.923281 0.004376
C  2.835527 1.505941 0.068899
C  3.470246 2.888666 -0.074262
C  3.160019 0.949212 1.455849
C  3.380959 0.584134 -1.023479
C  0.417439 0.794672 -0.044333
C  -0.356244 -1.291007 0.235971
C  -1.132779 -3.612909 0.507101
C  -1.751064 0.35994 -0.236069
C  -1.436406 -4.141141 -0.886578
H  3.265023 3.324251 -1.054592
H  3.106255 3.576454 0.691613
H  4.551811 2.818917 0.034042
H  2.776591 1.607091 2.236872
H  4.241029 0.871842 1.58257
H  2.729818 -0.039166 1.599341
H  4.464235 0.491172 -0.932139
H  2.948638 -0.411787 -0.95361
H  3.161202 0.985217 -2.013938
H  1.070252 2.635081 -0.309947
H  -0.778032 -4.41844 1.151695
H  -2.040282 -3.218542 0.962035
H  0.843418 -2.830735 0.631523
H  -1.828627 -3.346775 -1.520115
H  -0.544361 -4.551845 -1.360501
H  -2.184873 -4.932678 -0.838671
totalener: -1086.67972270 hartree
nucrepener: 1141.22142659 hartree
electener: -2227.90114929 hartree
oneelecener: -3751.15618228 hartree
twoeener: 1523.25503299 hartree
kineticenergy: 1083.29194236 hartree
xcener: -82.530384322707 hartree
chargesum: 0.0000000
charge: -0.044686 -0.204106 -0.440741 -0.356817 -0.217522 -0.374446 0.208891 -0.286764 -0.299059 -0.299669 0.427444 0.413092 0.002991 0.165629 -0.240067 0.100078 0.103658 0.082496 0.090507 0.081882 0.110287 0.081867 0.107921 0.090630 0.139061 0.081689 0.087446 0.143579 0.097186 0.068057 0.079485
qa: -0.0447 -0.2041 -0.4407 -0.3568 -0.2175 -0.3744 0.2089 -0.2868 -0.2991 -0.2997 0.4274 0.4131 0.0030 0.1656 -0.2401 0.1001 0.1037 0.0825 0.0905 0.0819 0.1103 0.0819 0.1079 0.0906 0.1391 0.0817 0.0874 0.1436 0.0972 0.0681 0.0795
va: 1.2600 3.1912 2.9668 2.9963 3.1999 2.9448 3.8952 3.8908 3.8837 3.8929 4.1486 4.1445 3.8739 4.4822 3.9050 1.0064 1.0064 1.0127 1.0131 1.0077 1.0218 1.0080 1.0202 1.0129 1.0480 0.9966 1.0196 1.0365 1.0118 1.0093 1.0111
dispcorr: -0.012619271 hartree
energy: -1086.692341972221
dipole: 28.49291 -26.99409 1.49883 -7.41721 6.83164 -0.58558 1.50636 -1.30460 0.20175
magnitude: 1.62175 au
magnitude: 4.12217 debye
