program: Orca
programVersion: 5.0.3
elementType: Cl N N N N N C C C C C C C C C H H H H H H H H H H H H H H H H
charge: 0
multiplicity: 1
keywords: wb97x-d3
keywords: def2-TZVPP
keywords: def2/J RIJCOSX
keywords: DEFGRID2
keywords: scfconv7
keywords: smallprint printgap noloewdin
keywords: NOSOSCF
formula: C9H16ClN5
InChI: InChI=1/C9H16ClN5/c1-5-11-7-12-6(10)13-8(14-7)15-9(2,3)4/h11,15H,5H2,1-4H3
31 atoms
Cl -3.528108 1.606786 -0.2478
N  1.3125 1.431355 -0.301161
N  0.22774 -0.538362 0.238858
N  -0.95333 1.454512 -0.260058
N  -0.994878 -2.397787 0.800369
N  -2.143858 -0.498167 0.301702
C  2.696174 0.967204 -0.190635
C  3.003939 0.487898 1.228818
C  2.984082 -0.140764 -1.205198
C  3.568679 2.181075 -0.51014
C  0.180715 0.746497 -0.096344
C  -0.955837 -1.10992 0.433486
C  0.158976 -3.260862 0.881511
C  -2.038937 0.75929 -0.045362
C  0.583839 -3.833357 -0.462985
H  2.410436 -0.385167 1.491239
H  4.058126 0.219185 1.312928
H  2.798169 1.273104 1.957424
H  4.035269 -0.429474 -1.158404
H  2.773598 0.197563 -2.220603
H  2.381886 -1.024984 -1.006762
H  3.379269 2.554587 -1.518563
H  3.395876 2.994702 0.197399
H  4.622983 1.913578 -0.451801
H  1.158717 2.394803 -0.549752
H  0.980833 -2.700455 1.325868
H  -0.084657 -4.066546 1.57542
H  -1.916131 -2.795072 0.868669
H  0.858254 -3.036878 -1.15375
H  1.447088 -4.488986 -0.344609
H  -0.217967 -4.415122 -0.918406
totalener: -1086.67957023 hartree
nucrepener: 1152.03311337 hartree
electener: -2238.71268359 hartree
oneelecener: -3772.65633757 hartree
twoeener: 1533.94365397 hartree
kineticenergy: 1083.28842737 hartree
xcener: -82.530220094862 hartree
chargesum: 0.0000000
charge: -0.044140 -0.203248 -0.447848 -0.361238 -0.208254 -0.351508 0.212413 -0.299374 -0.290418 -0.288985 0.423718 0.387978 -0.006782 0.172289 -0.245112 0.108712 0.082487 0.092181 0.083819 0.091841 0.096543 0.102445 0.102602 0.082472 0.139001 0.081813 0.088680 0.147558 0.086821 0.081534 0.082000
qa: -0.0441 -0.2032 -0.4478 -0.3612 -0.2083 -0.3515 0.2124 -0.2994 -0.2904 -0.2890 0.4237 0.3880 -0.0068 0.1723 -0.2451 0.1087 0.0825 0.0922 0.0838 0.0918 0.0965 0.1024 0.1026 0.0825 0.1390 0.0818 0.0887 0.1476 0.0868 0.0815 0.0820
va: 1.2586 3.1885 2.9569 2.9938 3.1809 2.9879 3.8882 3.8988 3.9042 3.8953 4.1527 4.2109 3.8991 4.4841 3.9067 1.0146 1.0082 1.0131 1.0094 1.0137 1.0134 1.0064 1.0062 1.0127 1.0481 1.0070 0.9992 1.0380 1.0053 1.0106 1.0099
dispcorr: -0.013507615 hartree
energy: -1086.693077841840
dipole: 35.18913 -33.62267 1.56647 -13.16140 12.28137 -0.88003 -0.33553 0.45737 0.12185
magnitude: 1.80087 au
magnitude: 4.57744 debye
