program: Orca
programVersion: 4.2.1
elementType: Cl O O N N C C C C C C C C C H H H H H H H H H H H H H
charge: 0
multiplicity: 1
keywords: wb97x-d3
keywords: def2-TZVPP
keywords: def2/J RIJCOSX GRIDX6 NOFINALGRIDX
keywords: grid4 nofinalgrid
keywords: scfconv7
keywords: smallprint printgap noloewdin
keywords: NOSOSCF
formula: C9H13ClN2O2
InChI: InChI=1/C9H13ClN2O2/c1-5-6(10)7(13)12(8(14)11-5)9(2,3)4/h11H,1-4H3
27 atoms
Cl 2.869908 -1.266944 -0.244968
O  0.075473 -1.965955 -0.216344
O  -1.539113 2.324148 0.240789
N  -0.863681 0.116967 0.046944
N  0.638047 1.914363 0.148251
C  -2.253919 -0.511557 0.062601
C  -2.50354 -1.208604 -1.27823
C  -2.351333 -1.477446 1.248435
C  -3.409068 0.481155 0.242964
C  0.224384 -0.765382 -0.09279
C  -0.666185 1.483717 0.149803
C  1.74344 1.141341 0.036979
C  1.546861 -0.184187 -0.084383
C  3.068226 1.812309 0.049083
H  -1.837638 -2.042461 -1.471232
H  -3.523154 -1.595665 -1.286791
H  -2.420548 -0.498868 -2.102667
H  -2.163517 -0.954719 2.187453
H  -1.680829 -2.326777 1.184968
H  -3.368115 -1.868757 1.295024
H  -3.379066 1.020164 1.186131
H  -3.511252 1.18744 -0.575939
H  -4.315377 -0.126033 0.253693
H  0.746888 2.916198 0.228381
H  3.705266 1.388809 0.824276
H  2.974532 2.880956 0.228939
H  3.574513 1.669886 -0.90559
elementType: Cl O N C H
totalener: -1071.06315233 hartree
nucrepener: 1073.78479411 hartree
electener: -2144.84794644 hartree
oneelecener: -3598.95600171 hartree
twoeener: 1454.10805527 hartree
cpcmener: -0.03181582 hartree
kineticenergy: 1067.74038605 hartree
xcener: -79.526313600899 hartree
chargesum: -0.0000000
charge: -0.086515 -0.486924 -0.510322 -0.090957 -0.112667 0.218604 -0.333042 -0.331880 -0.281638 0.352266 0.378086 0.179927 -0.139675 -0.199226 0.114457 0.098245 0.106864 0.105756 0.115075 0.097818 0.101767 0.099896 0.097382 0.184610 0.112791 0.091775 0.117529
qa: -0.0865 -0.4869 -0.5103 -0.0910 -0.1127 0.2186 -0.3330 -0.3319 -0.2816 0.3523 0.3781 0.1799 -0.1397 -0.1992 0.1145 0.0982 0.1069 0.1058 0.1151 0.0978 0.1018 0.0999 0.0974 0.1846 0.1128 0.0918 0.1175
va: 1.2449 2.0046 1.9824 3.2288 3.3222 3.7545 3.9001 3.8966 3.8712 4.2631 4.3331 3.8306 3.8454 3.9352 1.0228 1.0024 1.0049 1.0058 1.0226 1.0026 1.0128 1.0135 1.0036 1.0133 1.0003 1.0122 0.9981
dispcorr: -0.012277451 hartree
energy: -1071.075429784745
dipole: -18.36416 19.37055 1.00640 3.25535 -1.33059 1.92477 1.33668 -1.14677 0.18991
magnitude: 2.18028 au
magnitude: 5.54183 debye
