program: Orca
programVersion: 4.2.1
elementType: Cl O O N N C C C C C C C C C H H H H H H H H H H H H H
charge: 0
multiplicity: 1
keywords: wb97x-d3
keywords: def2-TZVPP
keywords: def2/J RIJCOSX GRIDX6 NOFINALGRIDX
keywords: grid4 nofinalgrid
keywords: scfconv7
keywords: smallprint printgap noloewdin
keywords: NOSOSCF
formula: C9H13ClN2O2
InChI: InChI=1/C9H13ClN2O2/c1-5-6(10)7(13)12(8(14)11-5)9(2,3)4/h11H,1-4H3
27 atoms
Cl 2.868628 -1.269943 -0.248121
O  0.073335 -1.965923 -0.214549
O  -1.54083 2.322271 0.242646
N  -0.865778 0.115839 0.047052
N  0.636274 1.91227 0.148472
C  -2.255073 -0.512133 0.062792
C  -2.501301 -1.208108 -1.27954
C  -2.349652 -1.476679 1.250159
C  -3.410679 0.481023 0.242337
C  0.222174 -0.767663 -0.092438
C  -0.669993 1.48308 0.150621
C  1.742541 1.139722 0.036718
C  1.547035 -0.185498 -0.084787
C  3.067996 1.812268 0.048691
H  -1.837286 -2.044551 -1.469923
H  -3.522559 -1.591561 -1.296685
H  -2.408846 -0.497334 -2.102836
H  -2.151299 -0.95236 2.186746
H  -1.682701 -2.329107 1.183762
H  -3.367576 -1.864806 1.306562
H  -3.383176 1.021118 1.18529
H  -3.512384 1.189366 -0.575175
H  -4.318168 -0.125188 0.251646
H  0.742613 2.914085 0.229071
H  3.706826 1.390308 0.823725
H  2.975187 2.881423 0.229397
H  3.575894 1.672181 -0.905851
elementType: Cl O N C H
totalener: -1071.06912181 hartree
nucrepener: 1073.76510916 hartree
electener: -2144.83423097 hartree
oneelecener: -3598.90661775 hartree
twoeener: 1454.07238678 hartree
cpcmener: -0.02563317 hartree
kineticenergy: 1067.74008434 hartree
xcener: -79.524023860824 hartree
chargesum: -0.0000000
charge: -0.083461 -0.461477 -0.483554 -0.095125 -0.119117 0.212826 -0.329594 -0.329742 -0.279027 0.342204 0.363876 0.174664 -0.140480 -0.203214 0.116064 0.096704 0.104151 0.103996 0.116650 0.096267 0.101765 0.100295 0.095375 0.180050 0.113158 0.089387 0.117357
qa: -0.0835 -0.4615 -0.4836 -0.0951 -0.1191 0.2128 -0.3296 -0.3297 -0.2790 0.3422 0.3639 0.1747 -0.1405 -0.2032 0.1161 0.0967 0.1042 0.1040 0.1167 0.0963 0.1018 0.1003 0.0954 0.1801 0.1132 0.0894 0.1174
va: 1.2484 2.0322 2.0150 3.2171 3.3097 3.7692 3.8994 3.8952 3.8751 4.2700 4.3491 3.8269 3.8472 3.9397 1.0229 1.0027 1.0055 1.0061 1.0226 1.0028 1.0128 1.0134 1.0036 1.0164 1.0003 1.0122 0.9980
dispcorr: -0.012286266 hartree
energy: -1071.081408077117
dipole: -18.33774 19.28353 0.94579 3.28355 -1.45932 1.82422 1.34255 -1.16309 0.17947
magnitude: 2.06265 au
magnitude: 5.24283 debye
