program: Orca
programVersion: 4.2.1
elementType: S O N N N N C C C C C C C C C H H H H H H H H H H H H H H H H
charge: 0
multiplicity: 1
keywords: wb97x-d3
keywords: def2-TZVPP
keywords: def2/J RIJCOSX GRIDX6 NOFINALGRIDX
keywords: grid4 nofinalgrid
keywords: scfconv7
keywords: smallprint printgap noloewdin
keywords: NOSOSCF
formula: C9H16N4OS
InChI: InChI=1/C9H16N4OS/c1-9(2,3)6-11-12-8(15-6)13(5)7(14)10-4/h10H,1-5H3
31 atoms
S  -0.850776 -1.20304 -0.000181
O  4.096363 -0.7416 -0.001006
N  -0.998034 1.321091 0.000209
N  1.821356 -0.806761 0.001068
N  0.32194 1.043942 0.000691
N  2.980273 1.225145 -0.000634
C  -3.256848 0.289506 -0.000574
C  -1.754666 0.282403 -0.000108
C  -3.76456 1.7295 -0.000479
C  -3.763236 -0.433575 1.252251
C  -3.76267 -0.433545 -1.253662
C  0.582537 -0.228492 0.000768
C  1.861056 -2.263184 0.000996
C  3.049553 -0.106138 -0.000135
C  4.14672 2.074963 -0.000665
H  -4.855105 1.72499 0.000303
H  -3.433671 2.277087 0.881641
H  -3.434878 2.277205 -0.882997
H  -3.390921 0.03794 2.16258
H  -4.853299 -0.405589 1.280659
H  -3.465092 -1.483511 1.269719
H  -3.391608 0.039328 -2.16378
H  -3.462875 -1.483055 -1.27227
H  -4.852785 -0.407044 -1.281416
H  1.377466 -2.665496 -0.88972
H  1.377782 -2.665915 0.891761
H  2.88996 -2.598323 0.000837
H  2.06552 1.664097 0.000429
H  4.154666 2.71309 0.882379
H  4.15379 2.714743 -0.88252
H  5.055888 1.483141 -0.00179
elementType: S O N C H
totalener: -1045.11368368 hartree
nucrepener: 1168.49561521 hartree
electener: -2213.60929888 hartree
oneelecener: -3748.80724043 hartree
twoeener: 1535.19794154 hartree
cpcmener: -0.02529762 hartree
kineticenergy: 1041.65134689 hartree
xcener: -81.795285019156 hartree
chargesum: -0.0000000
charge: -0.010528 -0.569048 -0.218471 -0.099704 -0.238027 -0.226908 0.220052 0.010671 -0.309556 -0.308352 -0.307944 0.184188 -0.186734 0.410926 -0.156577 0.101753 0.099046 0.099590 0.111081 0.101294 0.095602 0.111058 0.095873 0.100829 0.123859 0.124153 0.115790 0.195424 0.113416 0.113531 0.103715
qa: -0.0105 -0.5690 -0.2185 -0.0997 -0.2380 -0.2269 0.2201 0.0107 -0.3096 -0.3084 -0.3079 0.1842 -0.1867 0.4109 -0.1566 0.1018 0.0990 0.0996 0.1111 0.1013 0.0956 0.1111 0.0959 0.1008 0.1239 0.1242 0.1158 0.1954 0.1134 0.1135 0.1037
va: 2.6981 1.9512 3.0062 3.1998 2.9274 3.1699 3.7172 4.1754 3.9244 3.9344 3.9345 4.1828 3.8420 4.2702 3.8731 1.0044 1.0096 1.0095 1.0030 1.0031 1.0042 1.0030 1.0041 1.0032 0.9885 0.9885 1.0325 1.0566 0.9915 0.9915 1.0202
dispcorr: -0.012332711 hartree
energy: -1045.126016386066
dipole: -13.20949 11.15344 -2.05605 2.88182 -3.53909 -0.65727 -0.00217 0.00377 0.00160
magnitude: 2.15855 au
magnitude: 5.48661 debye
