program: Orca
programVersion: 4.2.1
elementType: S O N N N N C C C C C C C C C H H H H H H H H H H H H H H H H
charge: 0
multiplicity: 1
keywords: wb97x-d3
keywords: def2-TZVPP
keywords: def2/J RIJCOSX GRIDX6 NOFINALGRIDX
keywords: grid4 nofinalgrid
keywords: scfconv7
keywords: smallprint printgap noloewdin
keywords: NOSOSCF
formula: C9H16N4OS
InChI: InChI=1/C9H16N4OS/c1-9(2,3)6-11-12-8(15-6)13(5)7(14)10-4/h10H,1-5H3
31 atoms
S  -0.852809 -1.214453 -0.011565
O  4.097409 -0.705303 -0.001468
N  -1.00415 1.309973 0.003079
N  1.820605 -0.804988 -0.008172
N  0.314918 1.036477 0.002096
N  2.97007 1.240135 0.014319
C  -3.263166 0.28501 0.002175
C  -1.759867 0.27131 -0.003459
C  -3.758003 1.7296 -0.032663
C  -3.767372 -0.401249 1.276681
C  -3.78186 -0.466697 -1.228441
C  0.579944 -0.234419 -0.005098
C  1.87852 -2.258993 -0.022712
C  3.041368 -0.091651 0.001645
C  4.16908 2.042431 0.025605
H  -4.848897 1.738116 -0.027929
H  -3.417093 2.297845 0.832781
H  -3.424853 2.251759 -0.929685
H  -4.857561 -0.369402 1.310495
H  -3.472564 -1.451484 1.323615
H  -3.390392 0.093431 2.173041
H  -3.490627 -1.519088 -1.222774
H  -4.872257 -0.434227 -1.251693
H  -3.414151 -0.021552 -2.154139
H  1.400611 -2.659836 -0.917834
H  1.400673 -2.678436 0.863972
H  2.913532 -2.577856 -0.025951
H  2.0623 1.691337 0.015505
H  4.784452 1.873137 -0.858947
H  4.780258 1.854081 0.909198
H  3.872244 3.087678 0.03633
elementType: S O N C H
totalener: -1045.11921642 hartree
nucrepener: 1168.25473645 hartree
electener: -2213.37395288 hartree
oneelecener: -3748.30632946 hartree
twoeener: 1534.93237658 hartree
cpcmener: -0.02117981 hartree
kineticenergy: 1041.64569703 hartree
xcener: -81.791167032487 hartree
chargesum: -0.0000000
charge: -0.015681 -0.536225 -0.212067 -0.098834 -0.237260 -0.241995 0.217767 0.007812 -0.307109 -0.306751 -0.308486 0.182345 -0.187958 0.414216 -0.160427 0.100077 0.098974 0.100657 0.100546 0.095109 0.110403 0.094963 0.099885 0.111332 0.122045 0.122082 0.117479 0.195638 0.106245 0.105728 0.109492
qa: -0.0157 -0.5362 -0.2121 -0.0988 -0.2373 -0.2420 0.2178 0.0078 -0.3071 -0.3068 -0.3085 0.1823 -0.1880 0.4142 -0.1604 0.1001 0.0990 0.1007 0.1005 0.0951 0.1104 0.0950 0.0999 0.1113 0.1220 0.1221 0.1175 0.1956 0.1062 0.1057 0.1095
va: 2.6927 1.9917 3.0100 3.2064 2.9284 3.1525 3.7240 4.1718 3.9267 3.9335 3.9338 4.1815 3.8419 4.2716 3.9063 1.0042 1.0103 1.0097 1.0034 1.0047 1.0034 1.0042 1.0034 1.0031 0.9888 0.9887 1.0333 1.0583 0.9923 0.9924 0.9986
dispcorr: -0.012416444 hartree
energy: -1045.131632868942
dipole: -13.10557 11.15449 -1.95108 2.85761 -3.51311 -0.65550 0.07128 -0.07261 -0.00133
magnitude: 2.05825 au
magnitude: 5.23166 debye
