program: Gaussian 09
title: 000064103
version: EM64L-G09RevD.01
frameworkgroup: C1[X(C19H17N5O2)]
method: RPBEPBE
basis: SDD
operation: Freq
keyword: #p
keyword: freq=noraman
keyword: PBEPBE/SDD
title: #p freq=noraman PBEPBE/SDD
converged: YES YES NO NO
title: Mulliken charges:
elementType: O O N N N N N C C C C C C C C C C C C C C C C C C C H H H H H H H H H H H H H H H H H
charge: -0.252960 -0.263419 -0.218311 -0.048283 -0.432051 -0.122139 -0.171859 -0.489160 0.150743 0.161879 0.176254 0.049485 0.249741 -0.322194 -0.780614 -0.349096 -0.244092 -0.204129 0.176756 0.510804 0.497230 -0.656735 -0.371503 -0.395382 -0.220265 -0.808728 0.265948 0.288653 0.270183 0.228653 0.282546 0.271662 0.262065 0.234290 0.234372 0.340930 0.227951 0.320408 0.232695 0.227537 0.230105 0.237071 0.222957
chargesum: 0.00000
title: Mulliken charges with hydrogens summed into heavy atoms:
elementType: O O N N N N N C C C C C C C C C C C C C C C C C C C
charge: -0.252960 -0.263419 -0.218311 -0.048283 -0.091122 -0.122139 -0.171859 0.065442 0.150743 0.161879 0.176254 0.049485 0.249741 -0.052011 0.002247 -0.087030 -0.009802 0.030244 0.176756 0.510804 0.497230 -0.428784 -0.051095 -0.162687 0.007271 -0.118594
polarizability: 3.40627266e+02 -1.56764852e+01 2.64607400e+02 2.60218100e+00 2.03587256e+01 1.82825606e+02
1716.lowfreq: -2.9887 -0.0003 0.0005 0.0006 3.0076 10.5088 15.7056 16.1237 21.2388
frequency: 13.7571 16.0965 21.0766 32.7495 44.8353 62.5276 84.3735 87.8787 109.8822 160.6855 167.4034 193.8592 214.2209 215.1429 236.7654 241.6813 259.1483 301.7167 305.8719 328.9712 331.6020 364.3275 384.8801 397.3251 437.2121 441.2686 448.3553 483.6406 512.6604 523.4626 536.2964 543.7200 590.4248 594.9069 609.9105 628.3441 633.0952 650.1232 665.2010 683.7221 695.4544 701.7900 745.9117 754.7107 767.7252 784.6133 798.2912 803.5639 843.7562 849.8220 867.7853 869.4841 890.6617 897.3402 921.3739 927.5742 952.8985 980.3217 983.9848 986.2935 996.7013 1003.2869 1007.2752 1016.5944 1026.6489 1047.6341 1049.5942 1059.5351 1097.0197 1101.8809 1108.3772 1149.9964 1165.7753 1185.6060 1190.1628 1201.3345 1224.5249 1243.5489 1274.0972 1283.1295 1294.6989 1315.0178 1323.7989 1375.2450 1385.6320 1393.8795 1398.0291 1406.0664 1424.6023 1435.1109 1452.6699 1458.9189 1465.1479 1470.2446 1473.1993 1477.1130 1489.5312 1507.0411 1522.2190 1560.6096 1564.0341 1598.5854 1611.0128 1617.6033 1620.1436 1624.6682 2978.0941 2983.9767 3031.2127 3059.1130 3065.4337 3085.1795 3104.2315 3116.3689 3127.1339 3135.7014 3135.7553 3149.9464 3150.2671 3165.4045 3169.7215 3174.9775 3549.3311
redmass: 1.7768 2.5575 2.4105 5.4565 6.1290 6.8828 5.4328 7.8921 4.0511 4.3334 6.7542 4.7666 2.6621 1.2628 4.3280 5.3803 3.8147 4.3915 6.3068 6.7474 4.0776 6.0526 3.1262 2.2197 3.6003 2.7910 5.6873 5.7301 5.0300 3.6367 1.7338 7.9335 2.2789 4.3945 6.0164 5.6790 4.8017 5.7330 9.2499 4.8292 5.7445 2.1715 5.9282 7.1503 6.2516 1.4705 3.9790 1.3609 3.6842 4.6744 10.9540 1.4693 10.2146 1.5088 1.3674 3.5197 3.6539 1.3753 3.9437 4.6477 1.3176 1.3330 2.0695 2.2575 2.1030 1.5576 1.6462 2.4234 2.7700 1.9856 2.0693 3.0672 1.2308 1.5775 1.1366 2.4404 2.3280 3.6858 2.7686 2.7807 1.8986 1.5740 1.4011 1.6725 6.5462 9.1062 1.2476 1.2296 2.1006 1.1183 2.3513 2.6136 1.2473 1.1178 1.3429 1.0549 1.8055 4.5585 2.2238 6.1728 6.9884 6.1354 9.2910 8.3551 7.2309 5.8875 1.0377 1.0412 1.0635 1.0965 1.0955 1.0995 1.0915 1.0985 1.0874 1.0964 1.0874 1.0942 1.0901 1.0956 1.0976 1.0998 1.0761
irintensity: 0.5440 0.2707 2.0664 0.5920 0.8116 3.7952 1.4289 4.2071 5.5683 0.4571 0.6905 1.3012 3.1557 0.6027 0.4554 2.2834 4.8532 2.4038 0.8057 3.2805 0.7141 3.9052 6.9244 7.0098 2.1492 8.9522 0.1963 7.6667 1.1618 1.9439 40.7293 1.3422 38.4358 5.2692 2.0190 1.9277 7.5746 23.4382 9.6688 13.2890 24.9036 20.2709 9.6704 3.4832 10.1695 90.6680 1.1331 57.6275 6.0560 3.6948 21.9141 15.9594 16.0811 0.7710 8.0271 26.0194 28.0042 2.4911 5.5063 43.0219 2.7794 0.0006 1.2133 15.6139 2.9614 15.6840 8.1852 6.9198 14.5747 5.5602 7.2775 43.2401 8.2410 10.4608 0.2791 38.9788 5.0987 2.4024 16.8352 5.1439 13.3867 94.7834 0.4657 68.8399 5.1669 24.8721 14.8106 40.0882 6.6119 73.1091 7.6404 28.7365 36.1352 9.7516 15.7538 11.0418 61.3950 57.8614 22.3481 262.8371 2.4595 378.5388 390.5124 503.1453 26.8697 193.1075 35.2854 10.1408 26.9345 20.5604 6.2704 16.0297 19.6762 6.1510 8.5822 5.3398 2.5489 18.7196 6.9399 11.5228 13.6933 22.2199 43.1583
temp: 298.150 k
press: 1.00000 atm
elementType: 8 8 7 7 7 7 7 6 6 6 6 6 6 6 6 6 6 6 6 6 6 6 6 6 6 6 1 1 1 1 1 1 1 1 1 1 1 1 1 1 1 1 1
symmnumber: 1
zpe: 864073.9 jmol-1
zpe.correction: 0.329108 hartree
zpe.thermalcorrener: 0.351389 hartree
zpe.thermalcorrenthalpy: 0.352333 hartree
zpe.thermalcorrgfe: 0.273849 hartree
zpe.sumelectzpe: -1156.605371 hartree
zpe.sumelectthermal: -1156.583091 hartree
zpe.sumelectthermalent: -1156.582147 hartree
zpe.sumelectthermalfe: -1156.660631 hartree
dipole: 0.6346 2.8105 0.0888
dipole: 2.8826
quadrupole: -130.1463 -140.9240 -156.2578
quadrupole: 8.1974 2.8257 -2.7117
quadrupole: 12.2964 1.5187 -13.8151 8.1974 2.8257 -2.7117
hfenergy: -1156.9344798 hartree
pointgroup: C01 [X(C19H17N5O2)]
dipole: -0.2693267 0.935573 -0.5817094 debye
polarizability: 340.1025405|12.973732|225.7067493|-10.0774004|-46.1231936|222.2509826 unknown
InChI: InChI=1S/C19H17N5O2/c1-12-6-5-7-14(10-12)21-19-23-22-17(26-19)11-24-13(2)20-16-9-4-3-8-15(16)18(24)25/h3-10,21H,11H2,1-2H3
charge 0 multiplicity 1
43 atoms
O  -0.733153 -1.336447 -0.558547
O  2.284255 -1.064379 -2.224485
N  2.38659 -1.556219 0.073061
N  3.774229 -0.320226 1.601767
N  -2.891077 -0.41236 -0.404864
N  -0.705299 -2.681081 1.284939
N  -1.997092 -2.036165 1.235439
C  1.388783 -2.637653 -0.165555
C  3.700518 0.31005 -0.801064
C  2.924018 -1.307645 1.358686
C  2.758802 -0.782951 -1.082685
C  4.166416 0.511878 0.537347
C  0.000569 -2.262506 0.242173
C  4.135016 1.164022 -1.848891
C  2.532295 -2.225906 2.491659
C  5.065272 1.582169 0.803782
C  5.022865 2.215507 -1.570705
C  5.485827 2.42296 -0.239389
C  -1.964457 -1.25467 0.139485
C  -4.200418 -0.134514 0.08557
C  -6.297599 1.117854 -0.238096
C  -4.989583 0.785142 -0.654259
C  -4.713953 -0.741106 1.258418
C  -6.811186 0.506088 0.936646
C  -6.023107 -0.407658 1.668133
C  -7.130717 2.120729 -1.017723
H  1.67525 -3.545042 0.385874
H  1.416069 -2.838802 -1.251253
H  3.759305 0.977903 -2.860282
H  2.92485 -3.249034 2.332814
H  1.438429 -2.309567 2.617653
H  2.977696 -1.824908 3.412746
H  5.410193 1.719832 1.832803
H  5.36092 2.877281 -2.374964
H  6.178088 3.245526 -0.028432
H  -2.599152 0.065433 -1.259832
H  -4.58016 1.247294 -1.562927
H  -4.102084 -1.450126 1.821847
H  -7.826313 0.748056 1.272479
H  -6.429982 -0.87421 2.572142
H  -8.166157 1.760605 -1.155938
H  -7.19089 3.087735 -0.482402
H  -6.704179 2.319611 -2.01607
