program: Orca
programVersion: 5.0.3
elementType: Cl N N N N N C C C C C C C H H H H H H H H H H H H
charge: 0
multiplicity: 1
keywords: wb97x-d3
keywords: def2-TZVPP
keywords: def2/J RIJCOSX
keywords: DEFGRID2
keywords: scfconv7
keywords: smallprint printgap noloewdin
keywords: NOSOSCF
formula: C7H12ClN5
InChI: InChI=1/C7H12ClN5/c1-3-9-6-11-5(8)12-7(13-6)10-4-2/h9-10H,3-4H2,1-2H3
25 atoms
Cl 3.57325 0.014296 -0.178832
N  -0.686538 2.280589 0.390852
N  -0.669931 -2.3031 0.309621
N  -0.751426 -0.011292 0.32023
N  1.299373 -1.178084 0.073817
N  1.290102 1.178986 0.114154
C  -2.119328 2.437187 0.52022
C  -2.101193 -2.472238 0.441487
C  -0.050558 1.11708 0.271421
C  -0.041886 -1.13176 0.23202
C  -2.848746 2.458383 -0.812168
C  -2.842548 -2.428812 -0.883509
C  1.850357 0.003844 0.024167
H  -2.508015 1.638805 1.151998
H  -2.289568 3.37273 1.053598
H  -2.262407 -3.434672 0.927772
H  -2.488384 -1.70912 1.116648
H  -0.120423 3.109619 0.299169
H  -0.098236 -3.124892 0.191954
H  -2.723644 1.518982 -1.351682
H  -3.917103 2.611538 -0.652936
H  -2.488049 3.267381 -1.44908
H  -3.90798 -2.600087 -0.722769
H  -2.731333 -1.460672 -1.373072
H  -2.481044 -3.199255 -1.566206
elementType: Cl N C H
totalener: -1008.06813414 hartree
nucrepener: 904.77879421 hartree
electener: -1912.84692834 hartree
oneelecener: -3174.95743435 hartree
twoeener: 1262.11050601 hartree
cpcmener: -0.01999043 hartree
kineticenergy: 1005.04871275 hartree
xcener: -74.172176075138 hartree
chargesum: -0.0000000
charge: -0.067602 -0.195721 -0.195883 -0.462121 -0.400662 -0.400660 0.011881 0.011975 0.398222 0.398499 -0.256506 -0.256096 0.197518 0.082419 0.098559 0.098754 0.082090 0.173352 0.173476 0.080397 0.089340 0.084783 0.089415 0.080430 0.084140
qa: -0.0676 -0.1957 -0.1959 -0.4621 -0.4007 -0.4007 0.0119 0.0120 0.3982 0.3985 -0.2565 -0.2561 0.1975 0.0824 0.0986 0.0988 0.0821 0.1734 0.1735 0.0804 0.0893 0.0848 0.0894 0.0804 0.0841
va: 1.2351 3.2079 3.2072 2.9491 2.9675 2.9672 3.8564 3.8562 4.2245 4.2246 3.9203 3.9181 4.4706 1.0143 0.9971 0.9971 1.0142 1.0187 1.0187 1.0054 1.0076 1.0066 1.0075 1.0057 1.0068
dispcorr: -0.008991542 hartree
energy: -1008.077125677733
dipole: -31.43505 29.01294 -2.42211 -0.02054 0.00907 -0.01147 -2.26303 2.46478 0.20175
magnitude: 2.43053 au
magnitude: 6.17791 debye
