program: Orca
programVersion: 5.0.3
elementType: Cl N N N N N C C C C C C C H H H H H H H H H H H H
charge: 0
multiplicity: 1
keywords: wb97x-d3
keywords: def2-TZVPP
keywords: def2/J RIJCOSX
keywords: DEFGRID2
keywords: scfconv7
keywords: smallprint printgap noloewdin
keywords: NOSOSCF
formula: C7H12ClN5
InChI: InChI=1/C7H12ClN5/c1-3-9-6-11-5(8)12-7(13-6)10-4-2/h9-10H,3-4H2,1-2H3
25 atoms
Cl 3.541916 -0.001434 0.132913
N  -0.616149 2.410743 -0.556671
N  -0.835155 -2.108144 0.137383
N  -0.796434 0.153139 -0.199565
N  1.201852 -1.084664 0.128783
N  1.311121 1.242485 -0.224793
C  -2.045291 2.613251 -0.600138
C  -2.273769 -2.18234 0.030757
C  -0.029199 1.231792 -0.317334
C  -0.133085 -0.976836 0.016198
C  -2.685159 2.717022 0.776677
C  -2.737598 -3.620604 0.161565
C  1.823503 0.058676 -0.003657
H  -2.225779 3.524033 -1.172271
H  -2.495372 1.793716 -1.159439
H  -2.738005 -1.565113 0.804023
H  -2.594865 -1.768589 -0.928012
H  0.000797 3.204312 -0.575155
H  -0.301152 -2.943771 0.304921
H  -2.262033 3.541771 1.350356
H  -3.75843 2.888032 0.68715
H  -2.536049 1.796489 1.338855
H  -2.45933 -4.045292 1.127041
H  -3.821838 -3.674705 0.079783
H  -2.316157 -4.249534 -0.623627
totalener: -1008.04275644 hartree
nucrepener: 897.92188080 hartree
electener: -1905.96463724 hartree
oneelecener: -3160.83925856 hartree
twoeener: 1254.87462132 hartree
kineticenergy: 1005.08617112 hartree
xcener: -74.177903770764 hartree
chargesum: 0.0000000
charge: -0.043696 -0.208758 -0.204309 -0.439761 -0.353816 -0.352185 0.004833 0.021488 0.398997 0.392361 -0.239989 -0.269076 0.176800 0.084510 0.079753 0.080280 0.080019 0.148239 0.144093 0.074530 0.078653 0.088542 0.086948 0.082765 0.088781
qa: -0.0437 -0.2088 -0.2043 -0.4398 -0.3538 -0.3522 0.0048 0.0215 0.3990 0.3924 -0.2400 -0.2691 0.1768 0.0845 0.0798 0.0803 0.0800 0.1482 0.1441 0.0745 0.0787 0.0885 0.0869 0.0828 0.0888
va: 1.2583 3.1852 3.1629 2.9632 2.9898 2.9910 3.8838 3.8756 4.1967 4.2107 3.9027 3.9482 4.4793 0.9981 1.0173 0.9969 1.0003 1.0372 1.0439 1.0105 1.0104 1.0119 1.0001 1.0100 1.0005
dispcorr: -0.008464709 hartree
energy: -1008.051221145014
dipole: -30.78208 28.95507 -1.82702 -1.65327 1.64375 -0.00952 1.13714 -1.20300 -0.06585
magnitude: 1.82823 au
magnitude: 4.64699 debye
